Notice: Undefined variable: name in /srv/http/vhosts/ on line 248

Package Details: libtorrent-pyro-git 20161225-1

Git Clone URL: (read-only)
Package Base: libtorrent-pyro-git
Description: BitTorrent library written in C++ (git version)
Upstream URL:
Keywords: library pyroscope rtorrent torrent
Licenses: GPL
Conflicts: libtorrent, libtorrent-git
Provides: libtorrent
Submitter: skydrome
Maintainer: skydrome
Last Packager: skydrome
Votes: 15
Popularity: 0.421462
First Submitted: 2012-06-15 00:02
Last Updated: 2016-12-26 18:55

Required by (5)

Sources (1)

Latest Comments

frriarch commented on 2016-12-15 06:15

In file included from rak/
rak/allocators_test.h:1:45: fatal error: cppunit/extensions/HelperMacros.h: No such file or directory
#include <cppunit/extensions/HelperMacros.h>
compilation terminated.
make[2]: *** [Makefile:915: rak/LibTorrentTest-allocators_test.o] Error 1
make[2]: Leaving directory '/tmp/pkgbuild-1000/libtorrent-pyro-git/src/libtorrent/test'
make[1]: *** [Makefile:1572: check-am] Error 2
make[1]: Leaving directory '/tmp/pkgbuild-1000/libtorrent-pyro-git/src/libtorrent/test'
make: *** [Makefile:502: check-recursive] Error 1
==> ERROR: A failure occurred in check().

==> ERROR: the build failed

skydrome commented on 2015-12-16 09:53

changed, thx

Brottweiler commented on 2015-12-11 22:55

Upstream URL does not exist anymore it seems. Update to use the github website?

TwoLeaves commented on 2015-08-11 07:05

Checking the file system of /home with "stat" does not work for ext4 filesystems, as stat only ever returns "ext2/ext3" as per this bug:

dflt commented on 2015-07-27 20:04

curl: (22) The requested URL returned error: 404 Not Found
==> ERROR: Failure while downloading ps-ui_pyroscope_0.8.8.patch

skydrome commented on 2014-05-28 23:07

cppunit has been a build dep since 1977

rafi commented on 2014-04-29 17:10

I had to first install cppunit, otherwise build failed. cppunit should be added as a make dependency.

skydrome commented on 2013-01-16 17:49

temporary fix applied, thanks

Anonymous comment on 2013-01-14 04:05

" error: 'AM_CONFIG_HEADER': this macro is obsolete. You should use the 'AC_CONFIG_HEADERS' macro instead."

I just changed "AM_CONFIG" to "AC_CONFIG" in `` and it worked.