Warning: file_exists(): open_basedir restriction in effect. File(/srv/http/vhosts/aur.archlinux.org/public/web/locale//en/LC_MESSAGES/aurweb.mo) is not within the allowed path(s): (/srv/http/vhosts/aur-dev.archlinux.org/:/etc/aurweb/) in /srv/http/vhosts/aur-dev.archlinux.org/public/web/lib/streams.php on line 90
AUR (en) - libmonero-wallet-git

Notice: Undefined variable: name in /srv/http/vhosts/aur-dev.archlinux.org/public/web/lib/pkgfuncs.inc.php on line 248

Package Details: libmonero-wallet-git 0.10.1-1

Git Clone URL: https://aur-dev.archlinux.org/bitmonero-git.git (read-only)
Package Base: bitmonero-git
Description: Peer-to-peer network based anonymous digital currency (includes deaemon, wallet and miner)
Upstream URL: https://getmonero.org/
Licenses: custom:Cryptonote
Conflicts: libmonero-wallet, libmonerowallet-git
Provides: libmonero-wallet, libmonerowallet-git
Submitter: Onishin
Maintainer: Onishin (redfish)
Last Packager: Onishin
Votes: 9
Popularity: 0.973340
First Submitted: 2015-11-11 13:25
Last Updated: 2017-01-18 20:20

Latest Comments

1 2 3 Next › Last »

anonimal commented on 2016-11-12 02:22

@389git that looks like a regular build error not related to packaging. You can report that at https://github.com/monero-project/monero/issues. Edit: already reported upstream https://github.com/monero-project/monero/issues/1328

If you don't want to wait for the issue to be fixed, you can also try building the release version at https://aur.archlinux.org/packages/monero.

389git commented on 2016-11-11 13:35

pacaur -Syu aur/bitmonero-git
Yes you right, I activate 8Gb swap and build process was continued.
But it stopped with an error at 67%:
[ 67%] Linking CXX executable coretests
/tmp/makepkg/bitmonero-git/src/monero/src/crypto/slow-hash.c: В функции «cn_slow_hash»:
/tmp/makepkg/bitmonero-git/src/monero/src/crypto/oaes_lib.c:944:2: предупреждение: «aes_ctx», возможно, используется без инициализации в данной функции [-Wmaybe-uninitialized]
free( *_ctx );
/tmp/makepkg/bitmonero-git/src/monero/src/crypto/slow-hash.c:532:15: замечание: «aes_ctx» было объявлено здесь
oaes_ctx *aes_ctx;
[ 67%] Built target coretests
make: *** [Makefile:139: all] Ошибка 2
==> ОШИБКА: Произошел сбой в build().
:: Ошибка сборки пакета(ов) bitmonero-git
[user@gate ~]$
I think may be the error is related with the lack of hardware AES support.
model name : Intel Core i7 9xx (Nehalem Class Core i7)

flags : fpu vme de pse tsc msr pae mce cx8 apic sep mtrr pge mca cmov pat pse36 clflush mmx fxsr sse sse2 ss syscall nx rdtscp lm constant_tsc rep_good nopl pni pclmulqdq ssse3 cx16 pcid sse4_1 sse4_2 x2apic popcnt tsc_deadline_timer hypervisor lahf_lm fsgsbase smep erms
What do you think, what will be the advice?
what else can I do to find the cause?

I really appreciate any help you can provide.

anonimal commented on 2016-11-10 19:18

@389git you probably don't have enough memory on your system. Add more memory to your system or increase your swap space. Otherwise, file a bug report at https://bugs.archlinux.org/

389git commented on 2016-11-09 21:56

Build error:
[ 29%] Building CXX object src/cryptonote_core/CMakeFiles/obj_cryptonote_core.dir/cryptonote_core.cpp.o
c++: внутренняя ошибка компилятора: Убито (программа cc1plus)
Please submit a full bug report,
with preprocessed source if appropriate.
See <https://bugs.archlinux.org/> for instructions.

anonimal commented on 2016-09-21 23:54

@redfish I've opened https://github.com/monero-project/monero/issues/1114 but this package is only producing:

[ FAILED ] 3 tests, listed below:
[ FAILED ] DNSResolver.DNSSECFailure
[ FAILED ] DNSResolver.GetTXTRecord
[ FAILED ] AddressFromURL.Success

redfish commented on 2016-09-21 13:56

@anonimal: it might be a different problem because the DNS tests I was referring to are excluded (see check() in PKGBUILD). Maybe pastie your full output from running tests/unit_tests/unit_tests directly?

anonimal commented on 2016-09-21 06:55

DNS tests are still failing for me. I'm using dnsmasq + forcing a single nameserver in /etc/resolvconf.conf (and in /etc/resolv.conf, + said single nameserver). monerod works as expected though. Shall I open a ticket?

redfish commented on 2016-09-17 05:36

Update: excluded DNS tests that used to often fail on some systems (depending on nameserver in /etc/resolv.conf). Now the package should build and check fine with default args to makepkg/yaourt.

lmm5247 commented on 2016-09-03 23:37

@redfish, thanks! This worked for me!
yaourt --m-arg --nocheck -S monero-core-git

redfish commented on 2016-08-29 17:55

@DevotedFollower: yes, just rebuild the package. This is common: you have to manually update AUR packages when you update the system and the system contains an update to libraries used by AUR packages. I don't know of an easy way that would identify what needs to be rebuilt, but there should be a way because the dependencies are declared.