Warning: file_exists(): open_basedir restriction in effect. File(/srv/http/vhosts/aur.archlinux.org/public/web/locale//en/LC_MESSAGES/aurweb.mo) is not within the allowed path(s): (/srv/http/vhosts/aur-dev.archlinux.org/:/etc/aurweb/) in /srv/http/vhosts/aur-dev.archlinux.org/public/web/lib/streams.php on line 90
AUR (en) - libgcrypt15-git

Notice: Undefined variable: name in /srv/http/vhosts/aur-dev.archlinux.org/public/web/lib/pkgfuncs.inc.php on line 248

Package Details: libgcrypt15-git 1.5.4.r3.g35cd81f-1

Git Clone URL: https://aur-dev.archlinux.org/libgcrypt15-git.git (read-only)
Package Base: libgcrypt15-git
Description: General purpose cryptographic library based on the code from GnuPG. Latest commit from 1.5 branch - API version 11.
Upstream URL: http://www.gnupg.org
Licenses: GPL2
Conflicts: libgcrypt11, libgcrypt15
Provides: libgcrypt=1.5.4.r3.g35cd81f, libgcrypt15=1.5.4.r3.g35cd81f
Submitter: oxalin
Maintainer: oxalin
Last Packager: oxalin
Votes: 0
Popularity: 0.000000
First Submitted: 2015-04-18 23:27
Last Updated: 2015-07-24 04:29

Dependencies (5)

Required by (268)

Sources (1)

Latest Comments

oxalin commented on 2015-05-25 05:49

@tom.ty89: I've updated the PKGBUILD file. It should be fine now.

tom.ty89 commented on 2015-05-21 20:54

ghostscript should be a makedep as well

sh: gs: command not found
Error in ghostcript command
command was: gs -q -dSAFER -sDEVICE=png16m -r80 -g542x333 -sOutputFile=libgcrypt-modules.png -
Makefile:846: recipe for target 'libgcrypt-modules.png' failed
make[2]: *** [libgcrypt-modules.png] Error 255
make[2]: Leaving directory '/home/tom/libgcrypt15-git/src/libgcrypt/doc'
Makefile:470: recipe for target 'all-recursive' failed
make[1]: *** [all-recursive] Error 1
make[1]: Leaving directory '/home/tom/libgcrypt15-git/src/libgcrypt'
Makefile:402: recipe for target 'all' failed
make: *** [all] Error 2
==> ERROR: A failure occurred in build().