Warning: file_exists(): open_basedir restriction in effect. File(/srv/http/vhosts/aur.archlinux.org/public/web/locale//en/LC_MESSAGES/aurweb.mo) is not within the allowed path(s): (/srv/http/vhosts/aur-dev.archlinux.org/:/etc/aurweb/) in /srv/http/vhosts/aur-dev.archlinux.org/public/web/lib/streams.php on line 90
AUR (en) - libfreenect

Notice: Undefined variable: name in /srv/http/vhosts/aur-dev.archlinux.org/public/web/lib/pkgfuncs.inc.php on line 248

Package Details: libfreenect 0.5.3-1

Git Clone URL: https://aur-dev.archlinux.org/libfreenect.git (read-only)
Package Base: libfreenect
Description: Drivers and libraries for the Xbox Kinect device on Linux
Upstream URL: http://openkinect.org
Licenses: GPL
Submitter: Sandmann
Maintainer: Sandmann
Last Packager: Sandmann
Votes: 2
Popularity: 0.720175
First Submitted: 2012-10-31 19:41
Last Updated: 2016-02-21 15:05

Latest Comments

1 2 Next › Last »

petterk commented on 2016-06-23 06:39

[ 35%] Linking C static library ../lib/libfreenect.a
[ 35%] Built target freenectstatic
make: *** [Makefile:128: all] Error 2
==> ERROR: A failure occurred in build().
==> ERROR: Makepkg was unable to build libfreenect.

Sandmann commented on 2015-05-23 16:16

Thanks for the information. The issues should be solved by now.

efernandes commented on 2015-05-14 21:28

I got this error:

done, saved to SystemUpdate.zip
Extracting $Systemupdate/FFFE07DF00000001 from system update file...
Traceback (most recent call last):
File "/tmp/yaourt-tmp-macgyver/aur-libfreenect/src/libfreenect-0.5.2/src/fwfetcher.py", line 548, in <module>
pirs = extractPirsFromZip(fw)
File "/tmp/yaourt-tmp-macgyver/aur-libfreenect/src/libfreenect-0.5.2/src/fwfetcher.py", line 538, in extractPirsFromZip
pirs = z.open("$Systemupdate/FFFE07DF00000001").read()
File "/usr/lib/python2.7/zipfile.py", line 961, in open
zinfo = self.getinfo(name)
File "/usr/lib/python2.7/zipfile.py", line 909, in getinfo
'There is no item named %r in the archive' % name)
KeyError: "There is no item named '$Systemupdate/FFFE07DF00000001' in the archive"
src/CMakeFiles/firmware.dir/build.make:49: recipe for target 'src/CMakeFiles/firmware' failed
make[2]: *** [src/CMakeFiles/firmware] Error 1
CMakeFiles/Makefile2:110: recipe for target 'src/CMakeFiles/firmware.dir/all' failed
make[1]: *** [src/CMakeFiles/firmware.dir/all] Error 2
Makefile:116: recipe for target 'all' failed
make: *** [all] Error 2

Someone can help?

Thanks :)

dejavu commented on 2015-04-08 17:21

Thanks for the package!
Had to add following line to the cmake list for a successful built.

Sandmann commented on 2015-03-01 20:49

Updated to 0.5.2

Sandmann commented on 2014-08-02 22:45

Updated to 0.5.0

Sandmann commented on 2014-06-01 21:55

Updated to 0.4.3

0xffaa commented on 2014-05-26 16:16

new version 0.4.3

Sandmann commented on 2014-02-16 11:37

Updated to 0.4.0

Sandmann commented on 2014-02-16 10:59

Updated to 0.3.0