Warning: file_exists(): open_basedir restriction in effect. File(/srv/http/vhosts/aur.archlinux.org/public/web/locale//en/LC_MESSAGES/aurweb.mo) is not within the allowed path(s): (/srv/http/vhosts/aur-dev.archlinux.org/:/etc/aurweb/) in /srv/http/vhosts/aur-dev.archlinux.org/public/web/lib/streams.php on line 90
AUR (en) - libdigidocpp

Notice: Undefined variable: name in /srv/http/vhosts/aur-dev.archlinux.org/public/web/lib/pkgfuncs.inc.php on line 248

Package Details: libdigidocpp

Git Clone URL: https://aur-dev.archlinux.org/libdigidocpp.git (read-only)
Package Base: libdigidocpp
Description: Library for creating DigiDoc signature files
Upstream URL: http://www.id.ee/
Keywords: esteid
Licenses: LGPL
Submitter: kevku
Maintainer: kevku
Last Packager: kevku
Votes: 8
Popularity: 0.009677
First Submitted: 2012-12-12 12:15
Last Updated: 2016-09-01 06:37

Latest Comments

1 2 3 Next › Last »

kevku commented on 2016-08-14 11:52 has minizip 1.1 same as community and does not crash for me
does adding -DMINIZIP_INCLUDE_DIR="/usr/include/minizip/" help?
or -DMINIZIP_INCLUDE_DIR="" to use the bundled copy

enar commented on 2016-08-12 17:43

minizip is now newer than the version bundled with the libdigidoc package. The build system will detect that there is a system minizip, but unfortunately compiler will still use bundled header files. There is a structure that now got one extra field and the qdigidoc application crashes when trying to save a .bdoc file.

For myself I fixed it by renaming the bundled minizip directory to _minizip.

mareke commented on 2016-07-12 12:03

"Could not load a transcoding service"
It seems to be problem my locale settings.
I reselect my Language and Formats from System settings > Region & Language. After restart building works

kaurman commented on 2016-07-12 11:52

mareke, is this indeed the entire error message you get?

Just built the package myself yesterday, compiled fine.

mareke commented on 2016-07-12 11:47

make: *** [Makefile:128: all] Error 2
==> ERROR: A failure occurred in build().
==> ERROR: Makepkg was unable to build libdigidocpp.

kevku commented on 2016-05-06 07:33

delete src folder from previous build

mareke commented on 2016-05-06 06:34

Building gives error!
make[1]: *** [src/CMakeFiles/digidocpp_priv.dir/all] Error 2
Makefile:127: recipe for target 'all' failed
make: *** [all] Error 2

stefonarch commented on 2016-05-05 05:55

Source libdigidocpp_3.12.0.1317.orig.tar.xz not found, 404, please update.

kevku commented on 2016-02-02 18:28

added xxd to makedepends

kevku commented on 2015-11-03 18:40

disabled boost tests