Warning: file_exists(): open_basedir restriction in effect. File(/srv/http/vhosts/aur.archlinux.org/public/web/locale//en/LC_MESSAGES/aurweb.mo) is not within the allowed path(s): (/srv/http/vhosts/aur-dev.archlinux.org/:/etc/aurweb/) in /srv/http/vhosts/aur-dev.archlinux.org/public/web/lib/streams.php on line 90
AUR (en) - libdap

Notice: Undefined variable: name in /srv/http/vhosts/aur-dev.archlinux.org/public/web/lib/pkgfuncs.inc.php on line 248

Package Details: libdap 3.18.1-1

Git Clone URL: https://aur-dev.archlinux.org/libdap.git (read-only)
Package Base: libdap
Description: A library which contains an implementation of DAP 2.0 and 3.1
Upstream URL: https://www.opendap.org/index.php/software/libdap
Licenses: LGPL2.1
Submitter: graziano
Maintainer: graziano
Last Packager: graziano
Votes: 4
Popularity: 0.000778
First Submitted: 2006-12-01 13:04
Last Updated: 2016-10-09 08:56

Latest Comments

zottelef commented on 2016-07-28 10:26

gives error :
dds.yy: In function 'int ddsparse(libdap::parser_arg*)':
dds.yy:265:15: error: reference to 'array' is ambiguous
part = array;
In file included from BaseType.h:55:0,
from Byte.h:44,
from dds.yy:57:
Type.h:50:5: note: candidates are: libdap::Part array
In file included from /usr/include/c++/6.1.1/tuple:39:0,
from /usr/include/c++/6.1.1/bits/stl_map.h:63,
from /usr/include/c++/6.1.1/map:61,
from Keywords2.h:30,
from DDS.h:66,
from Vector.h:43,
from Array.h:48,
from dds.yy:66:
/usr/include/c++/6.1.1/array:90:12: note: template<class _Tp, long unsigned int _Nm> struct std::array
struct array
make[2]: *** [Makefile:2133: libparsers_la-dds.tab.lo] Error 1
make[2]: Leaving directory '/tmp/yaourt-tmp-fabio/aur-libdap/src/libdap-3.15.1'
make[1]: *** [Makefile:2304: all-recursive] Error 1
make[1]: Leaving directory '/tmp/yaourt-tmp-fabio/aur-libdap/src/libdap-3.15.1'
make: *** [Makefile:1184: all] Error 2

Morn commented on 2016-02-15 16:32

bison is also a dependency. And license should be an array.

graziano commented on 2010-09-26 15:21

Proposed new PKGBUILD