Notice: Undefined variable: name in /srv/http/vhosts/ on line 248

Package Details: lib32-libwbclient 4.5.4-1

Git Clone URL: (read-only)
Package Base: lib32-smbclient
Description: Samba winbind client library
Upstream URL:
Licenses: GPL3
Submitter: rafaelff
Maintainer: rafaelff
Last Packager: rafaelff
Votes: 13
Popularity: 1.418577
First Submitted: 2015-06-11 14:22
Last Updated: 2017-01-24 01:15

Latest Comments

1 2 3 4 Next › Last »

yurikoles commented on 2017-01-02 11:55

Download url is wrong, must be

rafaelff commented on 2016-09-17 00:48

lib32-tdb was updated to 1.3.11; now lib32-smbclient should build without issue.

Nightshaxx commented on 2016-09-16 19:23

Same issue as sharivegas. It looks for tdb >= 1.3.10 but doesn't find it, even though I have tdb 1.3.10-1. If is looking for lib32-tdb (which makes more sense), the latest available is lib32-tdb 1.3.9-1.

rafaelff commented on 2016-09-16 10:03

And lib32-tdb is flagged as out-of-date already.

sharivegas commented on 2016-09-16 09:18

Has a hard dependency on lib32-tdb >1.3.10, latest available is multilib/lib32-tdb 1.3.9-1.

rafaelff commented on 2016-06-13 15:05

@rodrigog83: thanks for the report. I added ldb to lib32-ldb's depends array. Please install the new release of lib32-ldb and try building lib32-smbclient again.

rodrigog83 commented on 2016-06-12 22:45

Had to add 'ldb' to makedepend because it complained that 'ldb.h' was not found.

flungo commented on 2016-05-21 11:36

I am getting the following error whilst trying to build:

[1668/3833] Compiling source4/libcli/ldap/ldap_controls.c
../source4/libcli/ldap/ldap_controls.c:1259:4: error: ‘LDB_CONTROL_DIRSYNC_EX_OID’ undeclared here (not in a function)
{ LDB_CONTROL_DIRSYNC_EX_OID, decode_dirsync_request, encode_dirsync_request },
Waf: Leaving directory `/tmp/yaourt-tmp-flungo/aur-lib32-smbclient/src/samba-4.4.3/bin'
Build failed: -> task failed (err #1):
{task: cc ldap_controls.c -> ldap_controls_1.o}
Makefile:8: recipe for target 'all' failed
make: *** [all] Error 1

Any suggestions? Anyone else getting the same?

xekarfwtos commented on 2016-04-01 07:41

I was able to install the package after the last update of lib32-talloc package on 2016-03-30

xekarfwtos commented on 2016-03-17 14:54

Building fails with the following error:
[3563/3900] Linking default/python/
default/source4/param/pyparam_util_10.o: In function `lpcfg_from_py_object':
pyparam_util.c:(.text+0xd5): undefined reference to `_pytalloc_get_type'
default/source4/librpc/rpc/pyrpc_util_44.o: In function `py_dcerpc_interface_init_helper':
pyrpc_util.c:(.text+0x4ca): undefined reference to `_pytalloc_get_type'
default/source4/librpc/rpc/pyrpc_util_44.o: In function `py_dcerpc_syntax_init_helper':
pyrpc_util.c:(.text+0x8bf): undefined reference to `_pytalloc_get_ptr'
collect2: error: ld returned 1 exit status
Waf: Leaving directory `/tmp/yaourt-tmp-ydamigos/aur-lib32-smbclient/src/samba-4.3.4/bin'
Build failed: -> task failed (err #1):
{task: cc_link modules_5.o,pyparam_util_10.o,samba_python.empty_2.o,pyrpc_util_44.o ->}
Makefile:8: recipe for target 'all' failed
make: *** [all] Error 1
==> ERROR: A failure occurred in build().
==> ERROR: Makepkg was unable to build lib32-smbclient.