Warning: file_exists(): open_basedir restriction in effect. File(/srv/http/vhosts/aur.archlinux.org/public/web/locale//en/LC_MESSAGES/aurweb.mo) is not within the allowed path(s): (/srv/http/vhosts/aur-dev.archlinux.org/:/etc/aurweb/) in /srv/http/vhosts/aur-dev.archlinux.org/public/web/lib/streams.php on line 90
AUR (en) - kwin-git

Notice: Undefined variable: name in /srv/http/vhosts/aur-dev.archlinux.org/public/web/lib/pkgfuncs.inc.php on line 248

Package Details: kwin-git r14246.6a19f50-2

Git Clone URL: https://aur-dev.archlinux.org/kwin-git.git (read-only)
Package Base: kwin-git
Description: KDE Window Manager
Upstream URL: https://projects.kde.org/projects/kde/kde-workspace
Licenses: LGPL
Groups: plasma
Conflicts: kdebase-workspace, kwin
Provides: kwin
Submitter: arojas
Maintainer: None
Last Packager: Alad
Votes: 13
Popularity: 0.068850
First Submitted: 2014-03-31 06:28
Last Updated: 2016-06-24 02:00

Latest Comments

1 2 3 Next › Last »

arojas commented on 2015-03-14 11:38

@greenmanalishi please report upstream

greenmanalishi commented on 2015-03-14 11:26

for me it fails [1] unlesss I set HAVE_INPUT to FALSE
1. https://paste.kde.org/pfjdsnzsx

arojas commented on 2015-02-14 12:20

@tmt00 why? does compilation fail with kdoctools?

tmt00 commented on 2015-02-14 11:45

You should update the dependencies from kdoctools to kdoctools-git.

sl1pkn07 commented on 2014-12-07 01:58

kwin-git E: Files in /usr/share/icons/hicolor but no call to gtk-update-icon-cache or xdg-icon-resource to update the icon cache
kwin-git W: Dependency kcmutils-git included but already satisfied
kwin-git W: Dependency libxcursor included but already satisfied
kwin-git W: Dependency libepoxy included but already satisfied


walkindude commented on 2014-09-20 23:14

sorry, wrong call, rebuilt kwindowsystem-git, everything ok now

walkindude commented on 2014-09-20 16:59

[ 91%] Building CXX object CMakeFiles/kwin.dir/shadow.cpp.o
[ 91%] Building CXX object CMakeFiles/kwin.dir/sm.cpp.o
/var/yaourt/yaourt-tmp-walkindude/aur-kwin-git/src/kwin/client.cpp: In member function ‘void KWin::Client::setShade(KWin::ShadeMode)’:
/var/yaourt/yaourt-tmp-walkindude/aur-kwin-git/src/kwin/client.cpp:1110:107: error: ‘class NETWinInfo’ has no member named ‘input’
if ((shade_mode == ShadeHover || shade_mode == ShadeActivated) && rules()->checkAcceptFocus(info->input()))
/var/yaourt/yaourt-tmp-walkindude/aur-kwin-git/src/kwin/client.cpp: In member function ‘void KWin::Client::takeFocus()’:
/var/yaourt/yaourt-tmp-walkindude/aur-kwin-git/src/kwin/client.cpp:1762:41: error: ‘class NETWinInfo’ has no member named ‘input’
if (rules()->checkAcceptFocus(info->input()))
/var/yaourt/yaourt-tmp-walkindude/aur-kwin-git/src/kwin/client.cpp: In member function ‘bool KWin::Client::wantsInput() const’:
/var/yaourt/yaourt-tmp-walkindude/aur-kwin-git/src/kwin/client.cpp:2238:44: error: ‘class NETWinInfo’ has no member named ‘input’
return rules()->checkAcceptFocus(info->input() || Ptakefocus);
/var/yaourt/yaourt-tmp-walkindude/aur-kwin-git/src/kwin/client.cpp:2239:1: error: control reaches end of non-void function [-Werror=return-type]
cc1plus: some warnings being treated as errors
CMakeFiles/kwin.dir/build.make:179: recipe for target 'CMakeFiles/kwin.dir/client.cpp.o' failed
make[2]: *** [CMakeFiles/kwin.dir/client.cpp.o] Error 1
make[2]: *** Waiting for unfinished jobs....
/var/yaourt/yaourt-tmp-walkindude/aur-kwin-git/src/kwin/events.cpp: In member function ‘bool KWin::Client::windowEvent(xcb_generic_event_t*)’:
/var/yaourt/yaourt-tmp-walkindude/aur-kwin-git/src/kwin/events.cpp:658:39: error: ‘WM2Urgency’ is not a member of ‘NET’
if (dirtyProperties2.testFlag(NET::WM2Urgency)) {
CMakeFiles/kwin.dir/build.make:547: recipe for target 'CMakeFiles/kwin.dir/events.cpp.o' failed
make[2]: *** [CMakeFiles/kwin.dir/events.cpp.o] Error 1
CMakeFiles/Makefile2:209: recipe for target 'CMakeFiles/kwin.dir/all' failed
make[1]: *** [CMakeFiles/kwin.dir/all] Error 2
Makefile:127: recipe for target 'all' failed
make: *** [all] Error 2
==> ERROR: A failure occurred in build().

desaparecido commented on 2014-08-28 13:58

@arojas hi, this problem is from git updated yesterday or day before, and when I had this stop building message I tried re-building all tree (unistalling KF5 git packages and deleting /opt/kf5 dir) to be sure and still the same message at same point. and effectivly like you, before that update was building fine.

arojas commented on 2014-08-28 13:21

@desaparecido you didn't post the actual error. It builds fine here (but my KF5-git is a week old)

desaparecido commented on 2014-08-28 12:53

hi, I have this error since yesterday (I thought) when trying to build:

[ 57%] Building CXX object kcmkwin/kwindecoration/CMakeFiles/kcm_kwindecoration.dir/preview.cpp.o
CMakeFiles/Makefile2:6123: recipe for target 'tests/CMakeFiles/waylandclienttest.dir/all' failed
make[1]: *** [tests/CMakeFiles/waylandclienttest.dir/all] Error 2
make[1]: *** Waiting for unfinished jobs....
[ 57%] Building CXX object kcmkwin/kwindecoration/CMakeFiles/kcm_kwindecoration.dir/decorationmodel.cpp.o
[ 58%] Building CXX object clients/aurorae/src/CMakeFiles/kwin3_aurorae.dir/lib/auroraetheme.cpp.o
[ 58%] Building CXX object effects/desktopgrid/CMakeFiles/kwin_desktopgrid_config.dir/kwin_desktopgrid_config_automoc.cpp.o
[ 58%] Building CXX object clients/aurorae/themes/plastik/code/CMakeFiles/plastikplugin.dir/plastikplugin.cpp.o
/home/luis/builds/kf5-git/kwin-git/src/kwin/kcmkwin/kwindecoration/decorationmodel.cpp: In member function ‘void KWin::DecorationModel::findDecorations()’:
/home/luis/builds/kf5-git/kwin-git/src/kwin/kcmkwin/kwindecoration/decorationmodel.cpp:133:33: warning: ‘KPluginInfo::KPluginInfo(KService::Ptr)’ is deprecated (declared at /usr/include/KF5/KService/kplugininfo.h:114) [-Wdeprecated-declarations]
KPluginInfo info(service);
[ 59%] Building CXX object kcmkwin/kwindecoration/CMakeFiles/kcm_kwindecoration.dir/__/__/clients/aurorae/src/lib/auroraetheme.cpp.o
[ 59%] Building CXX object kcmkwin/kwindecoration/CMakeFiles/kcm_kwindecoration.dir/__/__/clients/aurorae/src/lib/themeconfig.cpp.o
[ 59%] Building CXX object kcmkwin/kwindecoration/CMakeFiles/kcm_kwindecoration.dir/kcm_kwindecoration_automoc.cpp.o
[ 59%] Building CXX object clients/aurorae/src/CMakeFiles/kwin3_aurorae.dir/lib/themeconfig.cpp.o
Linking CXX shared library libplastikplugin.so
[ 59%] Built target plastikplugin
[ 59%] Building CXX object clients/aurorae/src/CMakeFiles/kwin3_aurorae.dir/kwin3_aurorae_automoc.cpp.o
Linking CXX shared module kwin_desktopgrid_config.so
[ 59%] Built target kwin_desktopgrid_config
Linking CXX shared module kcm_kwindecoration.so
[ 59%] Built target kcm_kwindecoration
Linking CXX shared module kwin3_aurorae.so
[ 59%] Built target kwin3_aurorae
Makefile:117: recipe for target 'all' failed
make: *** [all] Error 2
==> ERROR: A failure occurred in build().

I build all git packages of KF5 and the problem is still there :/