Warning: file_exists(): open_basedir restriction in effect. File(/srv/http/vhosts/aur.archlinux.org/public/web/locale//en/LC_MESSAGES/aurweb.mo) is not within the allowed path(s): (/srv/http/vhosts/aur-dev.archlinux.org/:/etc/aurweb/) in /srv/http/vhosts/aur-dev.archlinux.org/public/web/lib/streams.php on line 90
AUR (en) - kmod-git

Notice: Undefined variable: name in /srv/http/vhosts/aur-dev.archlinux.org/public/web/lib/pkgfuncs.inc.php on line 248

Package Details: kmod-git 19.33-1

Git Clone URL: https://aur-dev.archlinux.org/kmod-git.git (read-only)
Package Base: kmod-git
Description: interface to kernel module operations
Upstream URL: http://git.kernel.org/?p=utils/kernel/kmod/kmod.git;a=summary
Licenses: GPL2
Conflicts: kmod
Provides: kmod=19.33
Submitter: falconindy
Maintainer: falconindy
Last Packager: falconindy
Votes: 3
Popularity: 0.000000
First Submitted: 2011-12-14 00:15
Last Updated: 2015-07-04 17:47

Dependencies (4)

Required by (424)

Sources (2)

Latest Comments

falconindy commented on 2012-02-07 14:09

So? Fix it and send the patch upstream.

Anonymous comment on 2012-02-07 13:57

Got following error when trying to compile:

Making check in .
make --no-print-directory testsuite/uname.la testsuite/path.la testsuite/init_module.la testsuite/delete_module.la testsuite/libtestsuite.la testsuite/test-init testsuite/test-testsuite testsuite/test-loaded testsuite/test-modinfo testsuite/test-alias testsuite/test-new-module
CC testsuite/uname.lo
CCLD testsuite/uname.la
CC testsuite/path.lo
CCLD testsuite/path.la
CC testsuite/init_module.lo
CCLD testsuite/init_module.la
CC testsuite/delete_module.lo
CCLD testsuite/delete_module.la
CC testsuite/testsuite_libtestsuite_la-testsuite.lo
cc1: warnings being treated as errors
testsuite/testsuite.c: In function 'test_spawn_test':
testsuite/testsuite.c:133: error: dereferencing type-punned pointer might break strict-aliasing rules [-Wstrict-aliasing]
make[2]: *** [testsuite/testsuite_libtestsuite_la-testsuite.lo] Error 1
make[1]: *** [check-am] Error 2
make: *** [check-recursive] Error 1
make: Leaving directory `/home/user/builds/kmod-git/src/kmod-build'

ridikulusrat commented on 2012-01-01 16:20

@falconindy: And why is that? kmod itself is a relatively new software so i don't see why any reason xz support should not be enabled by default. Any link to ML discussion regadring this? Anyway I am asking for this flag (as default) in this package alone, not in extra/kmod (or is it core). Also why does this pkg use --with-rootlibdir=/lib while the same thing does not exist in extra/kmod pkg? kmod is required for udev>=176, right?

falconindy commented on 2012-01-01 16:03

Please add --with-xz yourself. There will never be xz support in the stable release in core.

ridikulusrat commented on 2012-01-01 13:16

BTW will xz compressed kernel modules reduce size of linux package in the filesystem (disk usage, not package size)? Seems like xz support is not in module-init-tools.

ridikulusrat commented on 2012-01-01 10:39

Please add --with-xz to ./autogen.sh . And why use --with-rootlibdir=/lib , why not --with-rootlibdir=/usr/lib ? Any advantage to use /lib when people are talking about moving everything to /usr (https://fedoraproject.org/wiki/Features/UsrMove)?

KriK commented on 2011-12-16 15:35

Very interesting...