Warning: file_exists(): open_basedir restriction in effect. File(/srv/http/vhosts/aur.archlinux.org/public/web/locale//en/LC_MESSAGES/aurweb.mo) is not within the allowed path(s): (/srv/http/vhosts/aur-dev.archlinux.org/:/etc/aurweb/) in /srv/http/vhosts/aur-dev.archlinux.org/public/web/lib/streams.php on line 90
AUR (en) - keeperrl-git

Notice: Undefined variable: name in /srv/http/vhosts/aur-dev.archlinux.org/public/web/lib/pkgfuncs.inc.php on line 248

Package Details: keeperrl-git r801-1

Git Clone URL: https://aur-dev.archlinux.org/keeperrl-git.git (read-only)
Package Base: keeperrl-git
Description: Dungeon Keeper and Dwarf Fortress inspired dungeon simulator built on top of roguelike mechanics.
Upstream URL: http://keeperrl.com/
Licenses: GPL
Conflicts: keeperrl
Submitter: Ferk
Maintainer: Ferk
Last Packager: Ferk
Votes: 7
Popularity: 0.000004
First Submitted: 2014-02-05 23:50
Last Updated: 2015-07-16 20:02

Latest Comments

1 2 Next › Last »

adomas commented on 2017-01-25 19:13

Got this error:
g++: error: unrecognized command line option ‘-Wimplicit-fallthrough’; did you mean ‘-Wno-fallthrough’?
make: *** [Makefile:102: stdafx.h.gch] Error 1

g++ version which is being used:
gcc version 6.3.1 20170109 (GCC)

vevais commented on 2016-05-12 11:41

I get the same error, any solutions so far?

pensnarik commented on 2016-01-15 11:33

Got this error:

window_view.cpp:32:21: fatal error: version.h: No such file or directory

Any ideas?

vbh commented on 2015-09-09 13:01

There is a serialization check failure.
Output after running build() function:
bash ./check_serial.sh
93c93
< chestInfo
---
> chase
252d251
< chase
254a254
> chestInfo
======== Serialization check failed ========
Makefile:115: „check_serial“ failed
make: *** [check_serial] Error 1

Any ideas?

Ferk commented on 2015-02-03 03:45

Fixed and updated.
angelscript is not a dependency.

owerner commented on 2015-02-02 15:24

==> Starting package()...
cp: cannot stat ‘*.png’: No such file or directory
cp: cannot stat ‘*.ttf’: No such file or directory

Athemis commented on 2014-07-14 18:06

It's also depending on angelscript>=2.29.0.

mrhanman commented on 2014-05-15 17:05

makedepends is missing boost

tacloban commented on 2014-04-06 16:15

Get this on startup:

terminate called after throwing an instance of 'std::string'
Aborted (core dumped)

flu commented on 2014-02-16 11:43

pkgver function produces "r136" while pkgver variable is different. Could you change the variable to make it consistent with the function result? Cause the AUR helper keeps asking me to upgrade.