Notice: Undefined variable: name in /srv/http/vhosts/ on line 248

Package Details: jss 4.3.1-1

Git Clone URL: (read-only)
Package Base: jss
Description: Network Security Services for Java (JSS) is a Java interface to NSS
Upstream URL:
Licenses: GPL
Submitter: None
Maintainer: ImNtReal
Last Packager: chenxiaolong
Votes: 2
Popularity: 0.000000
First Submitted: 2009-11-26 01:14
Last Updated: 2015-06-09 02:35

Required by (1)

Sources (20)

Latest Comments

fattylewis commented on 2016-04-09 21:18

I managed to get this to build by doing:

archlinux-java set java-7-jdk

Then building.

alexiobash commented on 2014-11-05 15:40

Command failed (72057594037927935) recipe for target 'buildJava' failed
make: *** [buildJava] Error 2

how to fix??

chenxiaolong commented on 2012-12-16 19:11

@tuxtard: Thanks! I didn't catch that from the previous maintainer's PKGBUILD :)

Anonymous comment on 2012-12-12 11:36

Thank you. I don't have to hack it anymore to make it build :D Please add i686 architecture. It works fine on it, so there is no need to limit it to x64.

chenxiaolong commented on 2012-11-15 03:33

Hi everyone! I've adopted this package and update it to the latest version. It now uses Fedora's patches and should build sucessfully now.

Anonymous comment on 2012-10-13 12:17

./coreconf/ Stop.

Anonymous comment on 2011-09-12 13:58


I'm unable to Build jss after unpacking:

U jss-4.3/mozilla/security/jss/samples/
U jss-4.3/mozilla/security/jss/samples/README.txt
U jss-4.3/mozilla/security/jss/samples/inputfile.pfx
U jss-4.3/mozilla/security/jss/samples/
make: Entering directory `/tmp/yaourt-tmp-psantos/aur-jss/src/jss-4.3/mozilla/security/coreconf'
../coreconf/ ../coreconf/ No such file or directory
make: *** No rule to make target ../coreconf/ Stop.
make: *** [../coreconf/] Error 1
make: Leaving directory `/tmp/yaourt-tmp-psantos/aur-jss/src/jss-4.3/mozilla/security/coreconf'
==> ERROR: A failure occurred in build().
==> ERROR: Makepkg was unable to build jss.
==> Restart building jss ? [y/N]
==> ----------------------------

Any suggestions?

Aierk commented on 2010-06-24 18:12

Falla la compilacion con jdk u openjdk6 y con ant en el path. Ademas el cvs falla en la segunda vez, le debe faltar un if o algo al pkgbuild.

Must specify JAVA_HOME environment variable at line 118.
make: *** [buildJava] Error 255
make: Leaving directory `/home/smorales/aur/jss/src/jss-4.3/mozilla/security/jss'