Warning: file_exists(): open_basedir restriction in effect. File(/srv/http/vhosts/aur.archlinux.org/public/web/locale//en/LC_MESSAGES/aurweb.mo) is not within the allowed path(s): (/srv/http/vhosts/aur-dev.archlinux.org/:/etc/aurweb/) in /srv/http/vhosts/aur-dev.archlinux.org/public/web/lib/streams.php on line 90
AUR (en) - hal

Notice: Undefined variable: name in /srv/http/vhosts/aur-dev.archlinux.org/public/web/lib/pkgfuncs.inc.php on line 248

Package Details: hal 0.5.15-2

Git Clone URL: https://aur-dev.archlinux.org/hal.git (read-only)
Package Base: hal
Description: Hardware Abstraction Layer
Upstream URL: http://www.freedesktop.org/wiki/Software/hal
Licenses: GPL, custom
Submitter: bidulock
Maintainer: bidulock
Last Packager: bidulock
Votes: 18
Popularity: 0.251218
First Submitted: 2015-08-13 23:13
Last Updated: 2016-06-01 00:33

Latest Comments

bidulock commented on 2016-06-01 00:35

I don't get this error. Perhaps there is a missing make depends?

ArnaudNux commented on 2016-02-24 16:57

hal-setup-keymap.c:149:19: error: dereferencing pointer to incomplete type 'const struct key'
keycode = name->id;
Makefile:1024: recipe for target 'hal-setup-keymap.o' failed
make[4]: *** [hal-setup-keymap.o] Error 1
make[4]: Leaving directory '/tmp/src/hal-0.5.15/tools'
Makefile:1060: recipe for target 'all-recursive' failed
make[3]: *** [all-recursive] Error 1
make[3]: Leaving directory '/tmp/src/hal-0.5.15/tools'
Makefile:684: recipe for target 'all' failed
make[2]: *** [all] Error 2
make[2]: Leaving directory '/tmp/src/hal-0.5.15/tools'
Makefile:536: recipe for target 'all-recursive' failed
make[1]: *** [all-recursive] Error 1
make[1]: Leaving directory '/tmp/src/hal-0.5.15'
Makefile:420: recipe for target 'all' failed
make: *** [all] Error 2
==> ERROR: A failure occurred in build().