Warning: file_exists(): open_basedir restriction in effect. File(/srv/http/vhosts/aur.archlinux.org/public/web/locale//en/LC_MESSAGES/aurweb.mo) is not within the allowed path(s): (/srv/http/vhosts/aur-dev.archlinux.org/:/etc/aurweb/) in /srv/http/vhosts/aur-dev.archlinux.org/public/web/lib/streams.php on line 90
AUR (en) - gummi-gtk3-git

Notice: Undefined variable: name in /srv/http/vhosts/aur-dev.archlinux.org/public/web/lib/pkgfuncs.inc.php on line 248

Package Details: gummi-gtk3-git 1341.3d91b69-1

Git Clone URL: https://aur-dev.archlinux.org/gummi-gtk3-git.git (read-only)
Package Base: gummi-gtk3-git
Description: Gummi LaTeX Editor Gtk3 port git version
Upstream URL: https://github.com/aitjcize/Gummi
Licenses: MIT
Conflicts: gummi, gummi-svn
Submitter: aitjcize
Maintainer: aitjcize
Last Packager: aitjcize
Votes: 19
Popularity: 0.798721
First Submitted: 2014-05-09 16:32
Last Updated: 2015-07-11 11:11

Latest Comments

1 2 3 Next › Last »

haawda commented on 2014-09-06 16:41

Uploaded the tarball again to be more AUR-3- compliant. No need to update for you people.

btw. in my previous comment I wanted to say that autogen.sh was invoked. There is no autorun-script.

jupbarrera commented on 2014-07-02 20:26

It works fine to me. Thanks!

haawda commented on 2013-11-08 07:02

Thanks for the advice. The autorun script is invoked now.

aitjcize commented on 2013-11-07 19:13

Hi I'm a Developer of Gummi.
We recently removed all autotools related files from the repo.
So you have to first run './autogen.sh' to generate the configure script.

haawda commented on 2013-06-30 12:25

removed "autoreconf": not needed and no longer working.

Nothing4You commented on 2013-06-19 22:12

nevermind that, i thought $depends wouldn't be required at build time

haawda commented on 2013-06-19 19:57

gtksourceview2 is in the depends array, so there is no need to put it to the makedepends array.

Nothing4You commented on 2013-06-19 05:37

Hey there, please add gtksourceview2 to the makedeps:

configure: error: You need gtksourceview-2 >= 2.2.1 to build gummi

haawda commented on 2011-11-09 19:54

I do not have that problem here, so maybe it is fixed upstream.

Anonymous comment on 2011-11-08 22:03

I get an error when i try to compile, seems to originate from a translation file?

fr.po:983: keyword "Retour" unknown
fr.po:983:64: syntax error
/usr/bin/msgfmt: found 3 fatal errors
make[2]: *** [fr.gmo] Error 1
make[2]: *** Waiting for unfinished jobs....
make[2]: Leaving directory `/tmp/yaourt-tmp-gustav/aur-gummi-svn/src/gummi-build/po'
make[1]: *** [all-recursive] Error 1
make[1]: Leaving directory `/tmp/yaourt-tmp-gustav/aur-gummi-svn/src/gummi-build'
make: *** [all] Error 2
==> ERROR: A failure occurred in build().
==> ERROR: Makepkg was unable to build gummi-svn.
==> Restart building gummi-svn ? [y/N]