Notice: Undefined variable: name in /srv/http/vhosts/aur-dev.archlinux.org/public/web/lib/pkgfuncs.inc.php on line 248

Package Details: gstreamer0.10-good-plugins 0.10.31-16

Git Clone URL: https://aur-dev.archlinux.org/gstreamer0.10-good.git (read-only)
Package Base: gstreamer0.10-good
Description: GStreamer Multimedia Framework Good Plugins (gst-plugins-good)
Upstream URL: http://gstreamer.freedesktop.org/
Licenses: LGPL
Groups: gstreamer0.10-plugins
Conflicts: gstreamer0.10-aalib, gstreamer0.10-annodex, gstreamer0.10-bad-plugins<0.10.7, gstreamer0.10-cairo, gstreamer0.10-cdio, gstreamer0.10-dv, gstreamer0.10-dv1394, gstreamer0.10-esd, gstreamer0.10-flac, gstreamer0.10-gconf, gstreamer0.10-gdkpixbuf, gstreamer0.10-jpeg, gstreamer0.10-libcaca, gstreamer0.10-libpng, gstreamer0.10-pulse, gstreamer0.10-shout2, gstreamer0.10-soup, gstreamer0.10-speex, gstreamer0.10-taglib, gstreamer0.10-wavpack
Replaces: gstreamer0.10-aalib, gstreamer0.10-annodex, gstreamer0.10-cairo, gstreamer0.10-cdio, gstreamer0.10-dv, gstreamer0.10-dv1394, gstreamer0.10-esd, gstreamer0.10-flac, gstreamer0.10-gconf, gstreamer0.10-gdkpixbuf, gstreamer0.10-jpeg, gstreamer0.10-libcaca, gstreamer0.10-libpng, gstreamer0.10-pulse, gstreamer0.10-shout2, gstreamer0.10-soup, gstreamer0.10-speex, gstreamer0.10-taglib, gstreamer0.10-wavpack
Submitter: yurikoles
Maintainer: yurikoles
Last Packager: yurikoles
Votes: 4
Popularity: 3.473050
First Submitted: 2017-01-26 13:56
Last Updated: 2017-01-28 17:45

Sources (3)

Latest Comments

1 2 Next › Last »

ector commented on 2017-01-31 09:21

thanks to the maintainer, I installed without problems

cybertron commented on 2017-01-30 18:53

Error: 'gstreamer0.10-good-plugins-0.10.31-16-x86_64.pkg.tar.xz': Twice Target

same with other gstreamer0.10 stuff, building with packer

dixi_minga commented on 2017-01-28 17:07

I have the same problem as daedite66 has

test-suite.log:
FAIL: generic/states
====================

Running suite(s): states
66%: Checks: 3, Failures: 0, Errors: 1
generic/states.c:113:E:general:test_state_changes_up_and_down_seq:0: (after this point) Test timeout expired
FAIL generic/states (exit status: 1)

frederick_monk commented on 2017-01-28 16:27

@yurikoles: Now it worked for me. gstreamer0.10-* is now up to date on my machines. Thank you!

deadite66 commented on 2017-01-28 16:16

FAIL: elements/souphttpsrc
============================================================================
Testsuite summary for GStreamer Good Plug-ins 0.10.31
============================================================================
# TOTAL: 69
# PASS: 68
# SKIP: 0
# XFAIL: 0
# FAIL: 1
# XPASS: 0
# ERROR: 0
============================================================================
See tests/check/test-suite.log
Please report to http://bugzilla.gnome.org/enter_bug.cgi?product=GStreamer
============================================================================
make[4]: *** [Makefile:2948: test-suite.log] Error 1
make[4]: Leaving directory '/tmp/yaourt-tmp-lee/aur-gstreamer0.10-good/src/gst-plugins-good/tests/check'
make[3]: *** [Makefile:3056: check-TESTS] Error 2
make[3]: Leaving directory '/tmp/yaourt-tmp-lee/aur-gstreamer0.10-good/src/gst-plugins-good/tests/check'
make[2]: *** [Makefile:3610: check-am] Error 2
make[2]: Leaving directory '/tmp/yaourt-tmp-lee/aur-gstreamer0.10-good/src/gst-plugins-good/tests/check'
make[1]: *** [Makefile:593: check-recursive] Error 1
make[1]: Leaving directory '/tmp/yaourt-tmp-lee/aur-gstreamer0.10-good/src/gst-plugins-good/tests'
make: *** [Makefile:715: check-recursive] Error 1

yurikoles commented on 2017-01-28 14:28

@all please update

ector commented on 2017-01-28 14:17

Me too

Swipe commented on 2017-01-28 13:46

Me too

dixi_minga commented on 2017-01-28 11:51

also with the new version I get compiler error:
make[3]: *** [Makefile:764: libgstvideo4linux2_la-gstv4l2bufferpool.lo] Error 1
make[3]: Leaving directory '/tmp/yaourt-tmp-dixi/aur-gstreamer0.10-good-plugins/src/gst-plugins-good-0.10.31/sys/v4l2'
make[2]: *** [Makefile:908: v4l2] Error 2
make[2]: Leaving directory '/tmp/yaourt-tmp-dixi/aur-gstreamer0.10-good-plugins/src/gst-plugins-good-0.10.31/sys'
make[1]: *** [Makefile:712: all-recursive] Error 1
make[1]: Leaving directory '/tmp/yaourt-tmp-dixi/aur-gstreamer0.10-good-plugins/src/gst-plugins-good-0.10.31'
make: *** [Makefile:641: all] Error 2


nagar commented on 2017-01-28 04:49

Confirm Compiler error :)

==> ERROR: A failure occurred in build().
Aborting...
==> ERROR: Makepkg was unable to build gstreamer0.10-good.