Warning: file_exists(): open_basedir restriction in effect. File(/srv/http/vhosts/aur.archlinux.org/public/web/locale//en/LC_MESSAGES/aurweb.mo) is not within the allowed path(s): (/srv/http/vhosts/aur-dev.archlinux.org/:/etc/aurweb/) in /srv/http/vhosts/aur-dev.archlinux.org/public/web/lib/streams.php on line 90
AUR (en) - gstreamer0.10-ffmpeg

Notice: Undefined variable: name in /srv/http/vhosts/aur-dev.archlinux.org/public/web/lib/pkgfuncs.inc.php on line 248

Package Details: gstreamer0.10-ffmpeg 0.10.13-7

Git Clone URL: https://aur-dev.archlinux.org/gstreamer0.10-ffmpeg.git (read-only)
Package Base: gstreamer0.10-ffmpeg
Description: Gstreamer FFMpeg Plugin
Upstream URL: http://gstreamer.freedesktop.org/
Licenses: GPL
Groups: gstreamer0.10-plugins
Submitter: yurikoles
Maintainer: yurikoles
Last Packager: yurikoles
Votes: 3
Popularity: 2.573375
First Submitted: 2017-01-26 13:47
Last Updated: 2017-01-28 15:12

Latest Comments

1 2 3 Next › Last »

abor333 commented on 2017-02-01 11:09

Same error as the others, it fails on ffdec_adpcm on a freshly installed machine.

ector commented on 2017-01-31 09:29

I installed the package without problems
thank you

damico commented on 2017-01-30 21:25

Tested today again. Same error

PASS: generic/plugin-test
PASS: generic/libavcodec-locking
FAIL: elements/ffdec_adpcm
PASS: elements/ffdemux_ape
PASS: elements/postproc

alfredo.ardito commented on 2017-01-29 17:42

Retested and same issue !

languitar commented on 2017-01-29 16:39

I can confirm the testing issue for ffdec_adpcm

alfredo.ardito commented on 2017-01-28 20:16

Tried updating again and failed.
The error reported is:
FAIL: elements/ffdec_adpcm

stefnix commented on 2017-01-28 17:57

Looks like a couple of the other gstreamer packages updated so everything is working again.

LKHN commented on 2017-01-28 11:01

Same here too.

tdallagn commented on 2017-01-28 07:36

Error building it.

make[3]: Nothing to be done for 'all-am'.
make[3]: Leaving directory '/tmp/yaourt-tmp-username/aur-gstreamer0.10-ffmpeg/src/gst-ffmpeg/gst-libs'
make[2]: Leaving directory '/tmp/yaourt-tmp-username/aur-gstreamer0.10-ffmpeg/src/gst-ffmpeg/gst-libs'
Making all in ext
make[2]: Entering directory '/tmp/yaourt-tmp-username/aur-gstreamer0.10-ffmpeg/src/gst-ffmpeg/ext'
Making all in ffmpeg
make[3]: Entering directory '/tmp/yaourt-tmp-username/aur-gstreamer0.10-ffmpeg/src/gst-ffmpeg/ext/ffmpeg'
CC libgstffmpeg_la-gstffmpeg.lo
In file included from /usr/include/gstreamer-0.10/gst/gst.h:32:0,
from gstffmpeg.c:29:
/usr/include/gstreamer-0.10/gst/gstversion.h:48:27: error: expected declaration specifiers or ‘...’ before ‘(’ token
#define GST_VERSION_MAJOR (0)
^
gstffmpeg.c:161:21: note: in expansion of macro ‘GST_VERSION_MAJOR’
GST_PLUGIN_DEFINE2 (GST_VERSION_MAJOR,
^~~~~~~~~~~~~~~~~
/usr/include/gstreamer-0.10/gst/gstversion.h:54:27: error: expected declaration specifiers or ‘...’ before ‘(’ token
#define GST_VERSION_MINOR (10)
^
gstffmpeg.c:162:5: note: in expansion of macro ‘GST_VERSION_MINOR’
GST_VERSION_MINOR,
^~~~~~~~~~~~~~~~~
gstffmpeg.c:163:5: error: unknown type name ‘ffmpeg’
ffmpeg,
^~~~~~
gstffmpeg.c:164:5: error: expected declaration specifiers or ‘...’ before string constant
"All FFmpeg codecs and formats (" FFMPEG_SOURCE ")",
^~~~~~~~~~~~~~~~~~~~~~~~~~~~~~~~~
gstffmpeg.c:165:5: error: expected declaration specifiers or ‘...’ before ‘plugin_init’
plugin_init, PACKAGE_VERSION,
^~~~~~~~~~~
In file included from gstffmpegutils.h:24:0,
from gstffmpeg.c:39:
../../config.h:140:25: error: expected declaration specifiers or ‘...’ before string constant
#define PACKAGE_VERSION "0.10.13"
^
gstffmpeg.c:165:18: note: in expansion of macro ‘PACKAGE_VERSION’
plugin_init, PACKAGE_VERSION,
^~~~~~~~~~~~~~~
gstffmpeg.c:169:5: error: expected declaration specifiers or ‘...’ before string constant
"GPL",
^~~~~
gstffmpeg.c:171:5: error: expected declaration specifiers or ‘...’ before string constant
"FFmpeg", "http://ffmpeg.org/")
^~~~~~~~
gstffmpeg.c:171:15: error: expected declaration specifiers or ‘...’ before string constant
"FFmpeg", "http://ffmpeg.org/")
^~~~~~~~~~~~~~~~~~~~
gstffmpeg.c:129:1: warning: ‘plugin_init’ defined but not used [-Wunused-function]
plugin_init (GstPlugin * plugin)
^~~~~~~~~~~
make[3]: *** [Makefile:584: libgstffmpeg_la-gstffmpeg.lo] Error 1
make[3]: Leaving directory '/tmp/yaourt-tmp-username/aur-gstreamer0.10-ffmpeg/src/gst-ffmpeg/ext/ffmpeg'
make[2]: *** [Makefile:449: all-recursive] Error 1
make[2]: Leaving directory '/tmp/yaourt-tmp-username/aur-gstreamer0.10-ffmpeg/src/gst-ffmpeg/ext'
make[1]: *** [Makefile:543: all-recursive] Error 1
make[1]: Leaving directory '/tmp/yaourt-tmp-username/aur-gstreamer0.10-ffmpeg/src/gst-ffmpeg'
make: *** [Makefile:472: all] Error 2
==> ERROR: A failure occurred in build().
Aborting...
==> ERROR: Makepkg was unable to build gstreamer0.10-ffmpeg.

Markiz commented on 2017-01-28 05:56

make[3]: *** [Makefile:584: libgstffmpeg_la-gstffmpeg.lo] Ошибка 1
make[3]: выход из каталога «/tmp/yaourt-tmp-user/aur-gstreamer0.10-ffmpeg/src/gst-ffmpeg/ext/ffmpeg»
make[2]: *** [Makefile:449: all-recursive] Ошибка 1
make[2]: выход из каталога «/tmp/yaourt-tmp-user/aur-gstreamer0.10-ffmpeg/src/gst-ffmpeg/ext»
make[1]: *** [Makefile:543: all-recursive] Ошибка 1
make[1]: выход из каталога «/tmp/yaourt-tmp-user/aur-gstreamer0.10-ffmpeg/src/gst-ffmpeg»
make: *** [Makefile:472: all] Ошибка 2
==> ОШИБКА: Произошел сбой в build().
Прерывание...
==> ОШИБКА: Makepkg не смог собрать gstreamer0.10-ffmpeg.
==> Перезапустить сборку gstreamer0.10-ffmpeg ? да/Нет [y/N]
==> ---