Warning: file_exists(): open_basedir restriction in effect. File(/srv/http/vhosts/aur.archlinux.org/public/web/locale//en/LC_MESSAGES/aurweb.mo) is not within the allowed path(s): (/srv/http/vhosts/aur-dev.archlinux.org/:/etc/aurweb/) in /srv/http/vhosts/aur-dev.archlinux.org/public/web/lib/streams.php on line 90
AUR (en) - gstreamer0.10-base-plugins

Package Details: gstreamer0.10-base-plugins 0.10.36-8

Git Clone URL: https://aur-dev.archlinux.org/gstreamer0.10-base.git (read-only)
Package Base: gstreamer0.10-base
Description: GStreamer Multimedia Framework Base Plugins (gst-plugins-base)
Upstream URL: http://gstreamer.freedesktop.org/
Licenses: LGPL
Groups: gstreamer0.10-plugins
Conflicts: gstreamer0.10-alsa, gstreamer0.10-cdparanoia, gstreamer0.10-libvisual, gstreamer0.10-ogg, gstreamer0.10-pango, gstreamer0.10-theora, gstreamer0.10-vorbis
Replaces: gstreamer0.10-alsa, gstreamer0.10-cdparanoia, gstreamer0.10-libvisual, gstreamer0.10-ogg, gstreamer0.10-pango, gstreamer0.10-theora, gstreamer0.10-vorbis
Submitter: yurikoles
Maintainer: yurikoles
Last Packager: yurikoles
Votes: 4
Popularity: 3.510709
First Submitted: 2017-01-26 13:45
Last Updated: 2017-01-30 08:02

Sources (7)

Latest Comments

1 2 3 Next › Last »

hopimet commented on 2017-02-04 20:57

Same for me: it does not compile on 32 bits, but it builds fine on 64 bits.

Bujhm666 commented on 2017-02-03 18:39

Does not compile. Errors:
In file included from resample_sse.h:38:0,
from resample.c:134,
from speex_resampler_float.c:26:
resample_sse.h: В функции «inner_product_single»:
/usr/lib/gcc/i686-pc-linux-gnu/6.3.1/include/xmmintrin.h:115:1: ошибка: inline-подстановка для вызова always_inline функции «_mm_setzero_ps» не выполнена: target specific option mismatch
_mm_setzero_ps (void)
^~~~~~~~~~~~~~
In file included from resample.c:134:0,
from speex_resampler_float.c:26:
resample_sse.h:46:11: замечание: которая вызвана здесь
__m128 sum = _mm_setzero_ps();
^~~
In file included from resample_sse.h:38:0,
from resample.c:134,
from speex_resampler_float.c:26:
/usr/lib/gcc/i686-pc-linux-gnu/6.3.1/include/xmmintrin.h:181:1: ошибка: inline-подстановка для вызова always_inline функции «_mm_add_ps» не выполнена: target specific option mismatch
_mm_add_ps (__m128 __A, __m128 __B)
^~~~~~~~~~
In file included from resample.c:134:0,
from speex_resampler_float.c:26:
resample_sse.h:50:11: замечание: которая вызвана здесь
sum = _mm_add_ps(sum, _mm_mul_ps(_mm_loadu_ps(a+i+4), _mm_loadu_ps(b+i+4)));
~~~~^~~~~~~~~~~~~~~~~~~~~~~~~~~~~~~~~~~~~~~~~~~~~~~~~~~~~~~~~~~~~~~~~~~~~~~
In file included from resample_sse.h:38:0,
from resample.c:134,
from speex_resampler_float.c:26:
/usr/lib/gcc/i686-pc-linux-gnu/6.3.1/include/xmmintrin.h:193:1: ошибка: inline-подстановка для вызова always_inline функции «_mm_mul_ps» не выполнена: target specific option mismatch
_mm_mul_ps (__m128 __A, __m128 __B)
^~~~~~~~~~
In file included from resample.c:134:0,
from speex_resampler_float.c:26:
resample_sse.h:50:13: замечание: которая вызвана здесь
sum = _mm_add_ps(sum, _mm_mul_ps(_mm_loadu_ps(a+i+4), _mm_loadu_ps(b+i+4)));
^~~~~~~~~~~~~~~~~~~~~~~~~~~~~~~~~~~~~~~~~~~~~~~~~~~~~~~~~~~~~~~~~~~~~
In file included from resample_sse.h:38:0,
from resample.c:134,
from speex_resampler_float.c:26:
/usr/lib/gcc/i686-pc-linux-gnu/6.3.1/include/xmmintrin.h:929:1: ошибка: inline-подстановка для вызова always_inline функции «_mm_loadu_ps» не выполнена: target specific option mismatch
_mm_loadu_ps (float const *__P)
^~~~~~~~~~~~
In file included from resample.c:134:0,
from speex_resampler_float.c:26:
resample_sse.h:50:13: замечание: которая вызвана здесь
sum = _mm_add_ps(sum, _mm_mul_ps(_mm_loadu_ps(a+i+4), _mm_loadu_ps(b+i+4)));
^~~~~~~~~~~~~~~~~~~~~~~~~~~~~~~~~~~~~~~~~~~~~~~~~~~~~~~~~~~~~~~~~~~~~
In file included from resample_sse.h:38:0,
from resample.c:134,
from speex_resampler_float.c:26:
/usr/lib/gcc/i686-pc-linux-gnu/6.3.1/include/xmmintrin.h:929:1: ошибка: inline-подстановка для вызова always_inline функции «_mm_loadu_ps» не выполнена: target specific option mismatch
_mm_loadu_ps (float const *__P)
^~~~~~~~~~~~
In file included from resample.c:134:0,
from speex_resampler_float.c:26:
resample_sse.h:50:13: замечание: которая вызвана здесь
sum = _mm_add_ps(sum, _mm_mul_ps(_mm_loadu_ps(a+i+4), _mm_loadu_ps(b+i+4)));
^~~~~~~~~~~~~~~~~~~~~~~~~~~~~~~~~~~~~~~~~~~~~~~~~~~~~~~~~~~~~~~~~~~~~
In file included from resample_sse.h:38:0,
from resample.c:134,
from speex_resampler_float.c:26:
/usr/lib/gcc/i686-pc-linux-gnu/6.3.1/include/xmmintrin.h:181:1: ошибка: inline-подстановка для вызова always_inline функции «_mm_add_ps» не выполнена: target specific option mismatch
_mm_add_ps (__m128 __A, __m128 __B)
^~~~~~~~~~
In file included from resample.c:134:0,
from speex_resampler_float.c:26:
resample_sse.h:49:11: замечание: которая вызвана здесь
sum = _mm_add_ps(sum, _mm_mul_ps(_mm_loadu_ps(a+i), _mm_loadu_ps(b+i)));
~~~~^~~~~~~~~~~~~~~~~~~~~~~~~~~~~~~~~~~~~~~~~~~~~~~~~~~~~~~~~~~~~~~~~~~
In file included from resample_sse.h:38:0,
from resample.c:134,
from speex_resampler_float.c:26:
/usr/lib/gcc/i686-pc-linux-gnu/6.3.1/include/xmmintrin.h:193:1: ошибка: inline-подстановка для вызова always_inline функции «_mm_mul_ps» не выполнена: target specific option mismatch
_mm_mul_ps (__m128 __A, __m128 __B)
^~~~~~~~~~
In file included from resample.c:134:0,
from speex_resampler_float.c:26:
resample_sse.h:49:13: замечание: которая вызвана здесь
sum = _mm_add_ps(sum, _mm_mul_ps(_mm_loadu_ps(a+i), _mm_loadu_ps(b+i)));
^~~~~~~~~~~~~~~~~~~~~~~~~~~~~~~~~~~~~~~~~~~~~~~~~~~~~~~~~~~~~~~~~
In file included from resample_sse.h:38:0,
from resample.c:134,
from speex_resampler_float.c:26:
/usr/lib/gcc/i686-pc-linux-gnu/6.3.1/include/xmmintrin.h:929:1: ошибка: inline-подстановка для вызова always_inline функции «_mm_loadu_ps» не выполнена: target specific option mismatch
_mm_loadu_ps (float const *__P)
^~~~~~~~~~~~
In file included from resample.c:134:0,
from speex_resampler_float.c:26:
resample_sse.h:49:13: замечание: которая вызвана здесь
sum = _mm_add_ps(sum, _mm_mul_ps(_mm_loadu_ps(a+i), _mm_loadu_ps(b+i)));
^~~~~~~~~~~~~~~~~~~~~~~~~~~~~~~~~~~~~~~~~~~~~~~~~~~~~~~~~~~~~~~~~
In file included from resample_sse.h:38:0,
from resample.c:134,
from speex_resampler_float.c:26:
/usr/lib/gcc/i686-pc-linux-gnu/6.3.1/include/xmmintrin.h:929:1: ошибка: inline-подстановка для вызова always_inline функции «_mm_loadu_ps» не выполнена: target specific option mismatch
_mm_loadu_ps (float const *__P)
^~~~~~~~~~~~
In file included from resample.c:134:0,
from speex_resampler_float.c:26:
resample_sse.h:49:13: замечание: которая вызвана здесь
sum = _mm_add_ps(sum, _mm_mul_ps(_mm_loadu_ps(a+i), _mm_loadu_ps(b+i)));
^~~~~~~~~~~~~~~~~~~~~~~~~~~~~~~~~~~~~~~~~~~~~~~~~~~~~~~~~~~~~~~~~
In file included from resample_sse.h:38:0,
from resample.c:134,
from speex_resampler_float.c:26:
/usr/lib/gcc/i686-pc-linux-gnu/6.3.1/include/xmmintrin.h:958:1: ошибка: inline-подстановка для вызова always_inline функции «_mm_store_ss» не выполнена: target specific option mismatch
_mm_store_ss (float *__P, __m128 __A)
^~~~~~~~~~~~
In file included from resample.c:134:0,
from speex_resampler_float.c:26:
resample_sse.h:54:4: замечание: которая вызвана здесь
_mm_store_ss(&ret, sum);
^~~~~~~~~~~~~~~~~~~~~~~
In file included from resample_sse.h:38:0,
from resample.c:134,
from speex_resampler_float.c:26:
/usr/lib/gcc/i686-pc-linux-gnu/6.3.1/include/xmmintrin.h:125:1: ошибка: inline-подстановка для вызова always_inline функции «_mm_add_ss» не выполнена: target specific option mismatch
_mm_add_ss (__m128 __A, __m128 __B)
^~~~~~~~~~
In file included from resample.c:134:0,
from speex_resampler_float.c:26:
resample_sse.h:53:8: замечание: которая вызвана здесь
sum = _mm_add_ss(sum, _mm_shuffle_ps(sum, sum, 0x55));
~~~~^~~~~~~~~~~~~~~~~~~~~~~~~~~~~~~~~~~~~~~~~~~~~~~~~
In file included from resample_sse.h:38:0,
from resample.c:134,
from speex_resampler_float.c:26:
/usr/lib/gcc/i686-pc-linux-gnu/6.3.1/include/xmmintrin.h:741:1: ошибка: inline-подстановка для вызова always_inline функции «_mm_shuffle_ps» не выполнена: target specific option mismatch
_mm_shuffle_ps (__m128 __A, __m128 __B, int const __mask)
^~~~~~~~~~~~~~
In file included from resample.c:134:0,
from speex_resampler_float.c:26:
resample_sse.h:53:10: замечание: которая вызвана здесь
sum = _mm_add_ss(sum, _mm_shuffle_ps(sum, sum, 0x55));
^~~~~~~~~~~~~~~~~~~~~~~~~~~~~~~~~~~~~~~~~~~~~~~
In file included from resample_sse.h:38:0,
from resample.c:134,
from speex_resampler_float.c:26:
/usr/lib/gcc/i686-pc-linux-gnu/6.3.1/include/xmmintrin.h:181:1: ошибка: inline-подстановка для вызова always_inline функции «_mm_add_ps» не выполнена: target specific option mismatch
_mm_add_ps (__m128 __A, __m128 __B)
^~~~~~~~~~
In file included from resample.c:134:0,
from speex_resampler_float.c:26:
resample_sse.h:52:8: замечание: которая вызвана здесь
sum = _mm_add_ps(sum, _mm_movehl_ps(sum, sum));
~~~~^~~~~~~~~~~~~~~~~~~~~~~~~~~~~~~~~~~~~~~~~~
In file included from resample_sse.h:38:0,
from resample.c:134,
from speex_resampler_float.c:26:
/usr/lib/gcc/i686-pc-linux-gnu/6.3.1/include/xmmintrin.h:782:1: ошибка: inline-подстановка для вызова always_inline функции «_mm_movehl_ps» не выполнена: target specific option mismatch
_mm_movehl_ps (__m128 __A, __m128 __B)
^~~~~~~~~~~~~
In file included from resample.c:134:0,
from speex_resampler_float.c:26:
resample_sse.h:52:10: замечание: которая вызвана здесь
sum = _mm_add_ps(sum, _mm_movehl_ps(sum, sum));
^~~~~~~~~~~~~~~~~~~~~~~~~~~~~~~~~~~~~~~~
make[3]: *** [Makefile:696: libgstaudioresample_la-speex_resampler_float.lo] Ошибка 1
make[3]: выход из каталога «/tmp/yaourt-tmp-sysop/aur-gstreamer0.10-base/src/gst-plugins-base/gst/audioresample»
make[2]: *** [Makefile:833: audioresample] Ошибка 2
make[2]: выход из каталога «/tmp/yaourt-tmp-sysop/aur-gstreamer0.10-base/src/gst-plugins-base/gst»
make[1]: *** [Makefile:678: all-recursive] Ошибка 1
make[1]: выход из каталога «/tmp/yaourt-tmp-sysop/aur-gstreamer0.10-base/src/gst-plugins-base»
make: *** [Makefile:607: all] Ошибка 2
==> ОШИБКА: Произошел сбой в build().
Прерывание...
==> ОШИБКА: Makepkg не смог собрать gstreamer0.10-base.

DemonSlayer452 commented on 2017-02-02 10:21

Will you finally fix your package for 32BiT ??

Cavsfan commented on 2017-02-01 23:08

I can confirm that it installs OK now.

midraed commented on 2017-02-01 20:05

gitlab.com is ON again.

yurikoles commented on 2017-02-01 16:35

I hope to release update soon, for now just replace https://gitlab.com by http://repo.or.cz

crowja commented on 2017-02-01 16:01

due to GitLab incident, is anyone have mirror about this package?

bal0r commented on 2017-02-01 06:15

I get lots of 502 error for all gstreamer0.10*, too.
Thank you very much in advance for handling the problem.

yurikoles commented on 2017-02-01 01:10

Their site is saying "Deploy in progress" now.

zerophase commented on 2017-02-01 00:07

remote: GitLab is not responding
fatal: unable to access 'https://gitlab.com/gstreamer-sdk/gst-plugins-base.git/': The requested URL returned error: 502

I get this error when attempting to update.