Warning: file_exists(): open_basedir restriction in effect. File(/srv/http/vhosts/aur.archlinux.org/public/web/locale//en/LC_MESSAGES/aurweb.mo) is not within the allowed path(s): (/srv/http/vhosts/aur-dev.archlinux.org/:/etc/aurweb/) in /srv/http/vhosts/aur-dev.archlinux.org/public/web/lib/streams.php on line 90
AUR (en) - gstreamer-git

Notice: Undefined variable: name in /srv/http/vhosts/aur-dev.archlinux.org/public/web/lib/pkgfuncs.inc.php on line 248

Package Details: gstreamer-git

Git Clone URL: https://aur-dev.archlinux.org/gstreamer-git.git (read-only)
Package Base: gstreamer-git
Description: GStreamer Multimedia Framework (Git version)
Upstream URL: http://gstreamer.freedesktop.org/
Keywords: glib streaming video
Licenses: LGPL
Conflicts: gstreamer
Provides: gstreamer=
Submitter: KerrickStaley
Maintainer: lubosz
Last Packager: lubosz
Votes: 12
Popularity: 0.945666
First Submitted: 2012-12-21 06:28
Last Updated: 2015-06-23 00:06

Required by (104)

Sources (1)

Latest Comments

lubosz commented on 2013-09-02 13:54

the patch wasn't needed anymore, since upstream provided bison 3.0 compatibility

KerrickStaley commented on 2013-08-31 20:09

Try building without 0002-parse-fix-build-with-bison-3.0.patch

ivdok commented on 2013-08-31 20:05

Same error, no solution provided. Marking as OoD.

ivdok commented on 2013-08-29 20:36

grammar.tab.c: In function 'priv_gst_parse_yyparse':
grammar.tab.c:1810:7: error: too many arguments to function 'priv_gst_parse_yylex'
if (yychar == YYEMPTY)
./grammar.y:38:5: note: declared here
int priv_gst_parse_yylex (void * yylval_param);
make[4]: *** [libgstparse_la-grammar.tab.lo] Error 1
make[4]: Leaving directory `/tmp/yaourt-tmp-ivdok/aur-gstreamer-git/src/gstreamer/gst/parse'
make[3]: *** [all-recursive] Error 1
make[3]: Leaving directory `/tmp/yaourt-tmp-ivdok/aur-gstreamer-git/src/gstreamer/gst'
make[2]: *** [all] Error 2
make[2]: Leaving directory `/tmp/yaourt-tmp-ivdok/aur-gstreamer-git/src/gstreamer/gst'
make[1]: *** [all-recursive] Error 1
make[1]: Leaving directory `/tmp/yaourt-tmp-ivdok/aur-gstreamer-git/src/gstreamer'
make: *** [all] Error 2
==> ERROR: A failure occurred in build().
==> ERROR: Makepkg was unable to build gstreamer-git.

KerrickStaley commented on 2013-07-10 04:49

Disowning; I've lost interest. Feel free to take over maintainership if you'd like :)

lubosz commented on 2013-07-09 12:17

Please update to pacman4

KerrickStaley commented on 2013-04-20 19:19

It builds fine for me without that flag. What are your CFLAGS set to (grep CFLAGS /etc/makepkg.conf)? What output is displayed when building without the flag?

ChristophLSA commented on 2013-04-20 10:27

I had to add "--disable-fatal-warnings" to the configure line.