Warning: file_exists(): open_basedir restriction in effect. File(/srv/http/vhosts/aur.archlinux.org/public/web/locale//en/LC_MESSAGES/aurweb.mo) is not within the allowed path(s): (/srv/http/vhosts/aur-dev.archlinux.org/:/etc/aurweb/) in /srv/http/vhosts/aur-dev.archlinux.org/public/web/lib/streams.php on line 90
AUR (en) - grive-git

Notice: Undefined variable: name in /srv/http/vhosts/aur-dev.archlinux.org/public/web/lib/pkgfuncs.inc.php on line 248

Package Details: grive-git 434.7bbb01c-2

Git Clone URL: https://aur-dev.archlinux.org/grive-git.git (read-only)
Package Base: grive-git
Description: An open source Linux client for Google Drive with support for the new Drive REST API and partial sync
Upstream URL: https://github.com/vitalif/grive2
Keywords: drive git Google share sync
Licenses: GPL2
Conflicts: grive
Provides: grive=434.7bbb01c
Submitter: ilpianista
Maintainer: edh
Last Packager: edh
Votes: 70
Popularity: 0.615406
First Submitted: 2012-04-29 15:20
Last Updated: 2017-01-07 14:06

Required by (1)

Sources (1)

Latest Comments

« First ‹ Previous 1 2 3 4 5 6 7 Next › Last »

ilpianista commented on 2012-05-30 14:54

@ctarwater
openssl is already installed by ca-certificates, which is needed by curl.
I haven't libstdc++5 on my system, and grive-git builds fine.

ctarwater commented on 2012-05-30 02:32

Thanks for maintaining this package!
I had to add 'libstdc++5' and 'openssl' in order to get this to compile and install/run properly. Once installed I created a new directory, cd-ed into it and ran 'grive-a' without any issues.

Anonymous comment on 2012-05-24 04:36

Same error as gdw and palpinter received.

ilpianista commented on 2012-05-23 17:39

Report the bug upstream!

palpinter commented on 2012-05-23 17:38

Does'nt work properly:


/tmp/yaourt-tmp-palpinter/aur-grive-git/src/grive/libgrive/src/util/Gdbm.cc: In constructor ‘gr::Gdbm::Gdbm(const string&)’:
/tmp/yaourt-tmp-palpinter/aur-grive-git/src/grive/libgrive/src/util/Gdbm.cc:39:78: error: invalid conversion from ‘void (*)()’ to ‘void (*)(const char*)’ [-fpermissive]
In file included from /tmp/yaourt-tmp-palpinter/aur-grive-git/src/grive/libgrive/src/util/Gdbm.cc:24:0:
/usr/include/gdbm.h:101:18: error: initializing argument 5 of ‘gdbm_file_info* gdbm_open(const char*, int, int, int, void (*)(const char*))’ [-fpermissive]
/tmp/yaourt-tmp-palpinter/aur-grive-git/src/grive/libgrive/src/util/Gdbm.cc:42:39: error: invalid conversion from ‘const char*’ to ‘char*’ [-fpermissive]
make[2]: *** [libgrive/CMakeFiles/grive.dir/src/util/Gdbm.cc.o] Error 1
make[1]: *** [libgrive/CMakeFiles/grive.dir/all] Error 2
make: *** [all] Error 2

gdw commented on 2012-05-23 16:40

Doesn't compile for me:

/tmp/yaourt-tmp-gwarner/aur-grive-git/src/grive/libgrive/src/util/Gdbm.cc: In constructor 'gr::Gdbm::Gdbm(const string&)':
/tmp/yaourt-tmp-gwarner/aur-grive-git/src/grive/libgrive/src/util/Gdbm.cc:39:78: error: invalid conversion from 'void (*)()' to 'void (*)(const char*)' [-fpermissive]
In file included from /tmp/yaourt-tmp-gwarner/aur-grive-git/src/grive/libgrive/src/util/Gdbm.cc:24:0:
/usr/include/gdbm.h:101:18: error: initializing argument 5 of 'gdbm_file_info* gdbm_open(const char*, int, int, int, void (*)(const char*))' [-fpermissive]
/tmp/yaourt-tmp-gwarner/aur-grive-git/src/grive/libgrive/src/util/Gdbm.cc:42:39: error: invalid conversion from 'const char*' to 'char*' [-fpermissive]
make[2]: *** [libgrive/CMakeFiles/grive.dir/src/util/Gdbm.cc.o] Error 1
make[1]: *** [libgrive/CMakeFiles/grive.dir/all] Error 2
make: *** [all] Error 2

ilpianista commented on 2012-05-17 18:01

@kammela
Report the bug upstream

Anonymous comment on 2012-05-17 17:37

I have a error when first start grive

[kammela@archp .grive]$ grive -a
terminate called after throwing an instance of 'gr::Config::Error'
what(): std::exception
Annullato

Anonymous comment on 2012-05-07 12:49

doesn't work for me too, same behaviour as reported by HarD

HarD commented on 2012-05-06 18:16

I have a error when start grive

grive -a
*** glibc detected *** grive: double free or corruption (top): 0x00000000013de1c0 ***
======= Backtrace: =========
/lib/libc.so.6(+0x78a56)[0x7fbd81c06a56]
/usr/lib/libcurl.so.4(+0x1ca54)[0x7fbd81732a54]
/usr/lib/libgrive.so.0(_ZN2gr4http5Agent6EscapeERKSs+0x4d)[0x7fbd82461d8d]
/usr/lib/libgrive.so.0(_ZN2gr6OAuth211MakeAuthURLERKSsS2_+0x81)[0x7fbd82462151]
grive(main+0x80)[0x4028b0]
/lib/libc.so.6(__libc_start_main+0xf5)[0x7fbd81baf455]
grive[0x4031e1]
======= Memory map: ========