Warning: file_exists(): open_basedir restriction in effect. File(/srv/http/vhosts/aur.archlinux.org/public/web/locale//en/LC_MESSAGES/aurweb.mo) is not within the allowed path(s): (/srv/http/vhosts/aur-dev.archlinux.org/:/etc/aurweb/) in /srv/http/vhosts/aur-dev.archlinux.org/public/web/lib/streams.php on line 90
AUR (en) - golden-cheetah-git

Notice: Undefined variable: name in /srv/http/vhosts/aur-dev.archlinux.org/public/web/lib/pkgfuncs.inc.php on line 248

Package Details: golden-cheetah-git V3.4.r34.18f4606-1

Git Clone URL: https://aur-dev.archlinux.org/golden-cheetah-git.git (read-only)
Package Base: golden-cheetah-git
Description: Cycling Power Analysis Software. We believe that cyclists and triathletes should be able to download their power data to the computer of their choice, analyze it in whatever way they see fit, and share their methods of analysis with others.
Upstream URL: http://www.goldencheetah.org/
Keywords: bike cheetah cycling gc golden
Licenses: GPL
Submitter: maxammann
Maintainer: maxammann
Last Packager: maxammann
Votes: 9
Popularity: 1.004398
First Submitted: 2015-12-21 17:18
Last Updated: 2016-12-04 23:15

Latest Comments

1 2 Next › Last »

maxammann commented on 2016-05-28 12:00

@climbone @Artefact2 sorry for the delay updated the package

More info on this update:
https://bugreports.qt.io/browse/QTBUG-53367

climbone commented on 2016-05-27 20:13

Could you explain how to do it with this QMAKE_DEFAULT_INCDIRS= . What I should paste there. Thanks

Artefact2 commented on 2016-05-21 12:36

Workaround:

--- PKGBUILD.old 2016-05-21 14:08:58.130137404 +0200
+++ PKGBUILD 2016-05-21 14:33:45.615567265 +0200
@@ -26,16 +26,16 @@

cd "qwt/"
cp qwtconfig.pri.in qwtconfig.pri
- qmake-qt5
+ qmake-qt5 QMAKE_DEFAULT_INCDIRS=
make -j8

cd "../kqoauth/"
- qmake-qt5
+ qmake-qt5 QMAKE_DEFAULT_INCDIRS=
make -j8

cd "../src/"
cp $srcdir/gcconfig.pri gcconfig.pri
- qmake-qt5 QMAKE_LRELEASE=/usr/bin/lrelease-qt5
+ qmake-qt5 QMAKE_LRELEASE=/usr/bin/lrelease-qt5 QMAKE_DEFAULT_INCDIRS=
make -j8
}

Artefact2 commented on 2016-05-21 10:48

Package does not compile with GCC6:

~~~
In file included from /usr/include/c++/6.1.1/bits/stl_algo.h:59:0,
from /usr/include/c++/6.1.1/algorithm:62,
from /usr/include/qt/QtCore/qglobal.h:85,
from /usr/include/qt/QtCore/qchar.h:37,
from /usr/include/qt/QtCore/qstring.h:41,
from /usr/include/qt/QtCore/QString:1,
from Charts/GoldenCheetah.h:30,
from Charts/DiaryWindow.h:22,
from Charts/DiaryWindow.cpp:20:
/usr/include/c++/6.1.1/cstdlib:75:25: fatal error: stdlib.h: No such file or directory
#include_next <stdlib.h>
^
compilation terminated.
Makefile:9546: recipe for target 'DiaryWindow.o' failed
make: *** [DiaryWindow.o] Error 1
~~~

AlexeyC commented on 2016-04-26 22:32

Thanks, compiled OK after manually added "qt5-connectivity".

maxammann commented on 2016-04-25 17:27

@AlexeyC Updated the package.

maxammann commented on 2016-04-19 21:27

@AlexeyC will look into it, thanks for reporting

AlexeyC commented on 2016-04-18 17:43

PfPvPlot.cpp multiple compillation errors on fresh/updated Arch, could you check it up, please.

Compiler output looks like:


PfPvPlot.cpp: In member function ‘void PfPvPlot::setData(RideItem*)’:
PfPvPlot.cpp:552:76: error: no matching function for call to ‘make_pair(double&, double&)’
dataSet.insert(std::make_pair<double, double>(aepf, cpv));
^
In file included from /usr/include/c++/5.3.0/utility:70:0,
from /usr/include/qt/QtCore/qcompilerdetection.h:928,
from /usr/include/qt/QtCore/qglobal.h:74,
from /usr/include/qt/QtCore/qchar.h:37,
from /usr/include/qt/QtCore/qstring.h:41,
from /usr/include/qt/QtCore/QString:1,
from GoldenCheetah.h:30,
from PfPvPlot.h:22,
from PfPvPlot.cpp:20:
/usr/include/c++/5.3.0/bits/stl_pair.h:276:5: note: candidate: template<class _T1, class _T2> constexpr std::pair<typename std::__decay_and_strip<_Tp>::__type, typename std::__decay_and_strip<_T2>::__type> std::make_pair(_T1&&, _T2&&)
make_pair(_T1&& __x, _T2&& __y)
^
/usr/include/c++/5.3.0/bits/stl_pair.h:276:5: note: template argument deduction/substitution failed:
PfPvPlot.cpp:552:76: note: cannot convert ‘aepf’ (type ‘double’) to type ‘double&&’
dataSet.insert(std::make_pair<double, double>(aepf, cpv));
^
PfPvPlot.cpp:564:87: error: no matching function for call to ‘make_pair(double&, double&)’
gearSet[0].insert(std::make_pair<double, double>(aepf, cpv));
^

maxammann commented on 2016-02-14 21:36

@MSCII thanks, added dependency!

MSCII commented on 2016-02-14 09:58

I ran into the error:
Project ERROR: Unknown module(s) in QT: script

After installing "qt5-script" the build+installation was successful.