Warning: file_exists(): open_basedir restriction in effect. File(/srv/http/vhosts/aur.archlinux.org/public/web/locale//en/LC_MESSAGES/aurweb.mo) is not within the allowed path(s): (/srv/http/vhosts/aur-dev.archlinux.org/:/etc/aurweb/) in /srv/http/vhosts/aur-dev.archlinux.org/public/web/lib/streams.php on line 90
AUR (en) - gnome-mpv-git

Notice: Undefined variable: name in /srv/http/vhosts/aur-dev.archlinux.org/public/web/lib/pkgfuncs.inc.php on line 248

Package Details: gnome-mpv-git 0.11.r0.g71c553c-1

Git Clone URL: https://aur-dev.archlinux.org/gnome-mpv-git.git (read-only)
Package Base: gnome-mpv-git
Description: GNOME frontend for MPV
Upstream URL: https://github.com/gnome-mpv/gnome-mpv
Licenses: GPL3
Conflicts: gnome-mpv
Provides: gnome-mpv
Submitter: serdotlinecho
Maintainer: symen
Last Packager: symen
Votes: 27
Popularity: 0.370784
First Submitted: 2014-10-12 15:19
Last Updated: 2017-01-11 08:59

Latest Comments

1 2 Next › Last »

TingPing commented on 2017-01-21 15:11

@hpstg Remove infinality

hpstg commented on 2017-01-21 13:59

I am getting this when trying to compile and install:

config.status: executing po/stamp-it commands

gnome-mpv 0.11

prefix ........: /usr
debug .........: no

Making all in src
make[1]: Entering directory '/home/USER/.cache/pacaur/gnome-mpv-git/src/gnome-mpv-git/src'
make all-am
make[2]: Entering directory '/home/USER/.cache/pacaur/gnome-mpv-git/src/gnome-mpv-git/src'
CCLD gnome-mpv
/usr/lib/libharfbuzz.so.0: undefined reference to `FT_Get_Var_Blend_Coordinates'
collect2: error: ld returned 1 exit status
make[2]: *** [Makefile:500: gnome-mpv] Error 1
make[2]: Leaving directory '/home/USER/.cache/pacaur/gnome-mpv-git/src/gnome-mpv-git/src'
make[1]: *** [Makefile:399: all] Error 2
make[1]: Leaving directory '/home/USER/.cache/pacaur/gnome-mpv-git/src/gnome-mpv-git/src'
make: *** [Makefile:400: all-recursive] Error 1
==> ERROR: A failure occurred in build().

symen commented on 2016-09-09 12:56


willemw commented on 2016-09-08 07:24

"provides=('gnome-mpv')" is missing.

symen commented on 2016-02-02 20:09

The install line was already as you wrote. Maybe you thought of the 'gnome-mpv' package instead of this one ?

By the way, I had to add another small fix for the package to build. Also the pkgver function returns v0.6 instead of v0.7, but it is actually more up to date than v0.7.

Mautz commented on 2016-02-02 11:19

I've got an error because the install line was wrong in the PKGBUILD.
correcting it to


did the trick.

symen commented on 2016-01-17 12:40

You are right, thanks!

beanaroo commented on 2016-01-17 07:51

It seems appstream-glib is a make dependency.

symen commented on 2015-10-27 08:38

Fixed! Thank you!

ainola commented on 2015-10-27 02:33

The license is GPL3, not just GPL :)