Warning: file_exists(): open_basedir restriction in effect. File(/srv/http/vhosts/aur.archlinux.org/public/web/locale//en/LC_MESSAGES/aurweb.mo) is not within the allowed path(s): (/srv/http/vhosts/aur-dev.archlinux.org/:/etc/aurweb/) in /srv/http/vhosts/aur-dev.archlinux.org/public/web/lib/streams.php on line 90
AUR (en) - gens-gs-sdl-git

Notice: Undefined variable: name in /srv/http/vhosts/aur-dev.archlinux.org/public/web/lib/pkgfuncs.inc.php on line 248

Package Details: gens-gs-sdl-git r3512.c4e1643-1

Git Clone URL: https://aur-dev.archlinux.org/gens-gs-git.git (read-only)
Package Base: gens-gs-git
Description: A Sega Genesis/CD/32X emulator
Upstream URL: http://segaretro.org/Gens/GS_II
Licenses: GPL
Conflicts: gens-gs-sdl
Provides: gens-gs-sdl
Submitter: alucryd
Maintainer: alucryd
Last Packager: alucryd
Votes: 0
Popularity: 0.000000
First Submitted: 2015-08-25 12:22
Last Updated: 2015-08-25 12:24

Dependencies (27)

Required by (0)

Sources (1)

Latest Comments

Joker-jar commented on 2016-09-02 12:34

As i know, this code supports x64. Isn't?

alucryd commented on 2015-08-25 12:29

Apparently there is now a sdl port, the qt4 port is no longer the default. Made a new PKGBUILD that builds and splits both ports into gens-gs-sdl-git and gens-gs-qt4-git.

salviati commented on 2015-08-16 19:52

Linker fails:

/usr/bin/ld: skipping incompatible /usr/lib/gcc/x86_64-unknown-linux-gnu/5.2.0/../../../libSDL2.so when searching for -lSDL2
/usr/bin/ld: skipping incompatible /usr/lib/libSDL2.so when searching for -lSDL2
/usr/bin/ld: cannot find -lSDL2
collect2: error: ld returned 1 exit status
src/gens-sdl/CMakeFiles/gens-sdl.dir/build.make:423: recipe for target 'src/gens-sdl/gens-sdl' failed
make[2]: *** [src/gens-sdl/gens-sdl] Error 1
CMakeFiles/Makefile2:2466: recipe for target 'src/gens-sdl/CMakeFiles/gens-sdl.dir/all' failed
make[1]: *** [src/gens-sdl/CMakeFiles/gens-sdl.dir/all] Error 2
Makefile:94: recipe for target 'all' failed
make: *** [all] Error 2
==> ERROR: A failure occurred in build().
==> ERROR: Makepkg was unable to build gens-gs-ii-git.
==> Restart building gens-gs-ii-git ? [y/N]