Warning: file_exists(): open_basedir restriction in effect. File(/srv/http/vhosts/aur.archlinux.org/public/web/locale//en/LC_MESSAGES/aurweb.mo) is not within the allowed path(s): (/srv/http/vhosts/aur-dev.archlinux.org/:/etc/aurweb/) in /srv/http/vhosts/aur-dev.archlinux.org/public/web/lib/streams.php on line 90
AUR (en) - fife

Notice: Undefined variable: name in /srv/http/vhosts/aur-dev.archlinux.org/public/web/lib/pkgfuncs.inc.php on line 248

Package Details: fife 0.4.0-2

Git Clone URL: https://aur-dev.archlinux.org/fife.git (read-only)
Package Base: fife
Description: Flexible Isometric Free Engine is a cross platform game creation framework
Upstream URL: http://fifengine.net/
Licenses: LGPL
Submitter: ChrisOelmueller
Maintainer: ChrisOelmueller
Last Packager: ChrisOelmueller
Votes: 2
Popularity: 0.851489
First Submitted: 2015-08-14 07:52
Last Updated: 2017-01-28 15:42

Latest Comments

ChrisOelmueller commented on 2017-01-28 15:43

[fife] v0.4.0-2: Clean up some dependencies (LinuxDonald)

Thanks! Hopefully that fixes your compilation.

dixi_minga commented on 2017-01-28 13:23

my system is uptodate and cmake was installed asdependency:
pacman -Qi cmake
Name : cmake
Version : 3.7.2-1

but with the PKGBUILD of LinuxDonald with his changed dependencies: Works!
Thanks

LinuxDonald commented on 2017-01-28 13:08

Fixed PKG file http://www.file-upload.net/download-12272430/PKGBUILD.html

dixi_minga commented on 2017-01-28 12:02

> Hm. Is `glibc` installed on your system?

yes, it is
pacman -Qi glibc
Name : glibc
Version : 2.24-2
Description : GNU C Library
Architecture : x86_64

dixi_minga commented on 2017-01-28 10:26

I got an error:
-- Found PythonLibs: /usr/lib64/libpython2.7.so (found suitable exact version "2.7.13")
-- Python install directory is '/usr/lib/python2.7/site-packages/fife'.
CMake Error: The following variables are used in this project, but they are set to NOTFOUND.
Please set them or make sure they are set and tested correctly in the CMake files:
Boost_INCLUDE_DIR (ADVANCED)
used as include directory in directory /tmp/fife/src/fifengine-0.4.0
used as include directory in directory /tmp/fife/src/fifengine-0.4.0
used as include directory in directory /tmp/fife/src/fifengine-0.4.0
used as include directory in directory /tmp/fife/src/fifengine-0.4.0
used as include directory in directory /tmp/fife/src/fifengine-0.4.0
used as include directory in directory /tmp/fife/src/fifengine-0.4.0
used as include directory in directory /tmp/fife/src/fifengine-0.4.0
used as include directory in directory /tmp/fife/src/fifengine-0.4.0

-- Configuring incomplete, errors occurred!
See also "/tmp/fife/src/fifengine-0.4.0/build/CMakeFiles/CMakeOutput.log".
See also "/tmp/fife/src/fifengine-0.4.0/build/CMakeFiles/CMakeError.log".
/CMakeError.log".


more /tmp/fife/src/fifengine-0.4.0/build/CMakeFiles/CMakeError.log
Determining if the pthread_create exist failed with the following output:
Change Dir: /tmp/fife/src/fifengine-0.4.0/build/CMakeFiles/CMakeTmp

Run Build Command:"/usr/bin/make" "cmTC_346ab/fast"
/usr/bin/make -f CMakeFiles/cmTC_346ab.dir/build.make CMakeFiles/cmTC_346ab.dir/build
make[1]: Entering directory '/tmp/fife/src/fifengine-0.4.0/build/CMakeFiles/CMakeTmp'
Building C object CMakeFiles/cmTC_346ab.dir/CheckSymbolExists.c.o
/usr/bin/cc -march=x86-64 -mtune=generic -O2 -pipe -fstack-protector-strong -o CMakeFiles/cmTC_346
ab.dir/CheckSymbolExists.c.o -c /tmp/fife/src/fifengine-0.4.0/build/CMakeFiles/CMakeTmp/CheckSymbolExi
sts.c
Linking C executable cmTC_346ab
/usr/bin/cmake -E cmake_link_script CMakeFiles/cmTC_346ab.dir/link.txt --verbose=1
/usr/bin/cc -march=x86-64 -mtune=generic -O2 -pipe -fstack-protector-strong -Wl,-O1,--sort-common,--a
s-needed,-z,relro CMakeFiles/cmTC_346ab.dir/CheckSymbolExists.c.o -o cmTC_346ab -rdynamic
CMakeFiles/cmTC_346ab.dir/CheckSymbolExists.c.o: In function `main':
CheckSymbolExists.c:(.text.startup+0x6): undefined reference to `pthread_create'
collect2: error: ld returned 1 exit status
make[1]: *** [CMakeFiles/cmTC_346ab.dir/build.make:98: cmTC_346ab] Error 1
make[1]: Leaving directory '/tmp/fife/src/fifengine-0.4.0/build/CMakeFiles/CMakeTmp'
make: *** [Makefile:126: cmTC_346ab/fast] Error 2

File /tmp/fife/src/fifengine-0.4.0/build/CMakeFiles/CMakeTmp/CheckSymbolExists.c:
/* */
#include <pthread.h>

int main(int argc, char** argv)
{
(void)argv;
#ifndef pthread_create
return ((int*)(&pthread_create))[argc];
#else
(void)argc;
return 0;
#endif
}

Determining if the function pthread_create exists in the pthreads failed with the following output:
Change Dir: /tmp/fife/src/fifengine-0.4.0/build/CMakeFiles/CMakeTmp

Run Build Command:"/usr/bin/make" "cmTC_2363a/fast"
/usr/bin/make -f CMakeFiles/cmTC_2363a.dir/build.make CMakeFiles/cmTC_2363a.dir/build
make[1]: Entering directory '/tmp/fife/src/fifengine-0.4.0/build/CMakeFiles/CMakeTmp'
Building C object CMakeFiles/cmTC_2363a.dir/CheckFunctionExists.c.o
/usr/bin/cc -march=x86-64 -mtune=generic -O2 -pipe -fstack-protector-strong -DCHECK_FUNCTION_EXISTS=p
thread_create -o CMakeFiles/cmTC_2363a.dir/CheckFunctionExists.c.o -c /usr/share/cmake-3.7/Modules/C
heckFunctionExists.c
Linking C executable cmTC_2363a
/usr/bin/cmake -E cmake_link_script CMakeFiles/cmTC_2363a.dir/link.txt --verbose=1
/usr/bin/cc -march=x86-64 -mtune=generic -O2 -pipe -fstack-protector-strong -DCHECK_FUNCTION_EXISTS=pth
read_create -Wl,-O1,--sort-common,--as-needed,-z,relro CMakeFiles/cmTC_2363a.dir/CheckFunctionExists.c
.o -o cmTC_2363a -rdynamic -lpthreads
/usr/bin/ld: cannot find -lpthreads
collect2: error: ld returned 1 exit status
make[1]: *** [CMakeFiles/cmTC_2363a.dir/build.make:98: cmTC_2363a] Error 1
make[1]: Leaving directory '/tmp/fife/src/fifengine-0.4.0/build/CMakeFiles/CMakeTmp'
make: *** [Makefile:126: cmTC_2363a/fast] Error 2

ChrisOelmueller commented on 2017-01-27 22:59

Updated to new release 0.4.0.

The build process was changed from Scons to cmake. If weird stuff happens, please leave a comment here and I'll get back to you!