Notice: Undefined variable: name in /srv/http/vhosts/ on line 248

Package Details: evince2-light 2.32.0-7

Git Clone URL: (read-only)
Package Base: evince2-light
Description: Simply a document viewer (GTK2 version, GNOME free!)
Upstream URL:
Licenses: GPL
Conflicts: evince
Provides: evince
Submitter: megadriver
Maintainer: shaggytwodope
Last Packager: shaggytwodope
Votes: 85
Popularity: 1.202785
First Submitted: 2011-08-31 10:56
Last Updated: 2015-09-22 09:43

Latest Comments

1 2 3 4 5 6 Next › Last »

AnbuBlack commented on 2015-12-11 17:42

You need o rebuild this package with the new ABI library (libstdc++).

Techman35 commented on 2015-01-30 21:55

Thank you very mush, for this fix... :)

shaggytwodope commented on 2014-12-13 04:46

Package updated with MaxKH's patch. Any issues contact email in pkgbuild.

Techman35 commented on 2014-11-22 00:15

Please update please

qs9rx commented on 2014-11-13 15:10

Update please, a solution was posted in the comments more than 4 months ago.

MaxKh commented on 2014-06-30 10:23

Got the same build error as 0strodamus

This patch fixes the issue:

Joel commented on 2014-06-20 15:51

Installation was ok! :D

Anonymous comment on 2014-04-20 20:08

fails to build:

tiff2ps.c: In function 'PS_Lvl2page':
tiff2ps.c:1131:4: error: format '%u' expects argument of type 'unsigned int', but argument 3 has type 'tsize_t' [-Werror=format=]
chunk_size, tiled_image ? "tiles" : "strips");
cc1: some warnings being treated as errors
Makefile:557: recipe for target 'tiff2ps.lo' failed
make[3]: *** [tiff2ps.lo] Error 1
make[3]: Leaving directory '/tmp/yaourt-tmp-user1/aur-evince2-light/src/evince-2.32.0/backend/tiff'
Makefile:471: recipe for target 'all-recursive' failed
make[2]: *** [all-recursive] Error 1
make[2]: Leaving directory '/tmp/yaourt-tmp-user1/aur-evince2-light/src/evince-2.32.0/backend'
Makefile:649: recipe for target 'all-recursive' failed
make[1]: *** [all-recursive] Error 1
make[1]: Leaving directory '/tmp/yaourt-tmp-user1/aur-evince2-light/src/evince-2.32.0'
Makefile:534: recipe for target 'all' failed
make: *** [all] Error 2

PhotonX commented on 2013-06-29 15:00

Evince crashes with a segfault if printing the PDF file. It happens if printing on a physical printer (available via CUPS) or printing to a PDF file. Printing to an SVG file works, printing to a PS file gives a file with blank pages, but the crash doesn't appear. Other readers (e.g. Okular) print with no problems. The debug output while printing is here:

Anonymous comment on 2013-01-15 20:49

Damn, are your fast! Like REALLY :)

I just tried compiling again as I had realized the last attempt was done under a custom kernel and I wanted to avoid false alarm - and indeed it compiled without probs. Quite confused I booted again to the custom kernel - worked there flawlessly as well.

I had some hard headscratching time trying to figure out what on earth I had changed the last couple of minutes - until I found your post. :)