Warning: file_exists(): open_basedir restriction in effect. File(/srv/http/vhosts/aur.archlinux.org/public/web/locale//en/LC_MESSAGES/aurweb.mo) is not within the allowed path(s): (/srv/http/vhosts/aur-dev.archlinux.org/:/etc/aurweb/) in /srv/http/vhosts/aur-dev.archlinux.org/public/web/lib/streams.php on line 90
AUR (en) - emulationstation-git

Notice: Undefined variable: name in /srv/http/vhosts/aur-dev.archlinux.org/public/web/lib/pkgfuncs.inc.php on line 248

Package Details: emulationstation-git 820.54a3c3e-1

Git Clone URL: https://aur-dev.archlinux.org/emulationstation-git.git (read-only)
Package Base: emulationstation-git
Description: A graphical front-end for emulators with controller navigation. Developed for the Raspbery Pi, but runs on most Linux systems.
Upstream URL: https://github.com/Herdinger/EmulationStation
Licenses: MIT
Provides: emulationstation
Submitter: drewbs
Maintainer: shaggytwodope
Last Packager: shaggytwodope
Votes: 25
Popularity: 1.759626
First Submitted: 2013-06-03 15:54
Last Updated: 2017-02-03 16:51

Latest Comments

« First ‹ Previous 1 2 3 4 5 Next › Last »

pientro commented on 2015-03-10 14:48

please add armv7h (it works)

DaVarga commented on 2015-01-27 13:31

@eolianoe: fixed

eolianoe commented on 2015-01-04 14:58

I can confirm that sdl need to be changed in sdl2, moreover could you delete a previous 'build' directory or create it with 'mkdir -p' in order to avoid an error on a second build.

stefanwilkens commented on 2014-11-25 00:17

Hey guys, ran into a few build errors on 64 bit.

After manually digging through the cmake errors, it seems this now requires 'sdl2' to build - at least on 64 bit. That got me past the initial configuration checks and through the build process.

stefanwilkens commented on 2014-11-24 23:09

Hey guys, ran into a few build errors on 64 bit.

After manually digging through the cmake errors, it seems this now requires 'sdl2' to build - at least on 64 bit. That got me past the initial configuration checks.

Sadly, that now dumps me on a compiler error - gcc requesting me to file a bug report, that's a new one! Appears to hang on 23% for a good while before resulting in a compiler error.

Can somebody else on 64 bit confirm?

cornholio commented on 2014-08-01 18:13

@mbrown
Thanks, I've added it

mbrown commented on 2014-07-31 14:37

The error reported by Shakz seems to be fixed by installing the "glu" package --- it should be added as a dependency.

cornholio commented on 2014-04-07 23:48

Sorry, I can't replicate your error. The error is pretty ambiguous, which is one of the things I dislike about cmake in general.

Shakz commented on 2014-03-26 12:49

This errors out for me.
compilation terminated.
CMakeFiles/emulationstation.dir/build.make:80: recipe for target 'CMakeFiles/emulationstation.dir/src/FolderData.cpp.o' failed
make[2]: *** [CMakeFiles/emulationstation.dir/src/FolderData.cpp.o] Error 1
CMakeFiles/Makefile2:63: recipe for target 'CMakeFiles/emulationstation.dir/all' failed
make[1]: *** [CMakeFiles/emulationstation.dir/all] Error 2
Makefile:75: recipe for target 'all' failed
make: *** [all] Error 2
==> ERROR: A failure occurred in build().
Aborting...
==> ERROR: Makepkg was unable to build emulationstation-git.
Any suggestions?

cornholio commented on 2014-02-04 03:59

@anatolik
Thanks. I implemented the changes as you suggested.