Warning: file_exists(): open_basedir restriction in effect. File(/srv/http/vhosts/aur.archlinux.org/public/web/locale//en/LC_MESSAGES/aurweb.mo) is not within the allowed path(s): (/srv/http/vhosts/aur-dev.archlinux.org/:/etc/aurweb/) in /srv/http/vhosts/aur-dev.archlinux.org/public/web/lib/streams.php on line 90
AUR (en) - emulationstation-git

Notice: Undefined variable: name in /srv/http/vhosts/aur-dev.archlinux.org/public/web/lib/pkgfuncs.inc.php on line 248

Package Details: emulationstation-git 820.54a3c3e-1

Git Clone URL: https://aur-dev.archlinux.org/emulationstation-git.git (read-only)
Package Base: emulationstation-git
Description: A graphical front-end for emulators with controller navigation. Developed for the Raspbery Pi, but runs on most Linux systems.
Upstream URL: https://github.com/Herdinger/EmulationStation
Licenses: MIT
Provides: emulationstation
Submitter: drewbs
Maintainer: shaggytwodope
Last Packager: shaggytwodope
Votes: 25
Popularity: 1.759626
First Submitted: 2013-06-03 15:54
Last Updated: 2017-02-03 16:51

Latest Comments

« First ‹ Previous 1 2 3 4 5 Next › Last »

squalou commented on 2016-01-06 21:13

Additional note for whoever might read this : a warning at the beginning, but loosely related only

-- Boost version: 1.60.0
-- Found the following Boost libraries:
-- system
-- filesystem
-- date_time
-- locale
-- Configuring done
CMake Warning at es-app/CMakeLists.txt:102 (add_executable):
Cannot generate a safe linker search path for target emulationstation
because files in some directories may conflict with libraries in implicit
directories:

link library [libGLESv1_CM.so] in /usr/lib may be hidden by files in:
/opt/vc/lib

Some of these libraries may not be found correctly.

squalou commented on 2016-01-06 21:01

this could be related : missing the instruction to effectively link against libboost_locale lib, but ... no idea where to fix it within cmake

http://stackoverflow.com/questions/21750547/undefined-reference-to-boostlocaleconvbetween

squalou commented on 2016-01-06 09:30

Tried to compile yesterday, apparently against boost 1.60.0-1

After a compilation with some minor warnings, the link step fails :

`boost::locale::generator::generate(std::string const&) const'

How can this be fixed ?

more details : (full log available if needed)

[100%] Linking CXX executable ../../emulationstation
CMakeFiles/emulationstation.dir/src/main.cpp.o: In function `main':
main.cpp:(.text.startup+0x50): undefined reference to `boost::locale::generator::generate(std::string const&) const'
collect2: error: ld returned 1 exit status
es-app/CMakeFiles/emulationstation.dir/build.make:909: recipe for target '../emulationstation' failed
make[2]: *** [../emulationstation] Error 1
CMakeFiles/Makefile2:274: recipe for target 'es-app/CMakeFiles/emulationstation.dir/all' failed
make[1]: *** [es-app/CMakeFiles/emulationstation.dir/all] Error 2
Makefile:149: recipe for target 'all' failed
make: *** [all] Error 2

RicardoScar commented on 2015-10-22 17:37

emulationstation is asking for boost-libs v1.58.0, but in the Extra repos there is boost-libs v1.59.0.
Is there something I can do?

EDIT.: Turned out I just needed to recompile (:

joao commented on 2015-05-24 11:21

emulationstation won't start on arch linux ARM - Raspberry Pi 2:

$ emulationstation
terminate called after throwing an instance of 'std::logic_error'
what(): basic_string::_S_construct null not valid
Aborted (core dumped)


tterpelle commented on 2015-05-04 13:28

For Raspberry Pi 2 support, I think you will also need to change

if [ "$CARCH" = "armv6h" ]

to

if [ "$CARCH" = "armv6h" -o "$CARCH" = "armv7h" ]

DaVarga commented on 2015-03-17 10:57

libsdl bugreport on bugzilla:
https://bugzilla.libsdl.org/show_bug.cgi?id=2879

DaVarga commented on 2015-03-17 10:46

looks like SDL2 problem,
https://github.com/Aloshi/EmulationStation/issues/395#issuecomment-76035498

pientro commented on 2015-03-10 18:36

On Raspberry2 this error when I launch it!

lvl0: Error initializing SDL!
No available video device
lvl0: Renderer failed to initialize!
lvl0: Window failed to initialize!

DaVarga commented on 2015-03-10 18:03

-added armv7h