Warning: file_exists(): open_basedir restriction in effect. File(/srv/http/vhosts/aur.archlinux.org/public/web/locale//en/LC_MESSAGES/aurweb.mo) is not within the allowed path(s): (/srv/http/vhosts/aur-dev.archlinux.org/:/etc/aurweb/) in /srv/http/vhosts/aur-dev.archlinux.org/public/web/lib/streams.php on line 90
AUR (en) - dolfin-git

Notice: Undefined variable: name in /srv/http/vhosts/aur-dev.archlinux.org/public/web/lib/pkgfuncs.inc.php on line 248

Package Details: dolfin-git 20151005-1

Git Clone URL: https://aur-dev.archlinux.org/dolfin-git.git (read-only)
Package Base: dolfin-git
Description: the C++/Python interface of FEniCS, providing a consistent PSE (Problem Solving Environment) for ordinary and partial differential equations.
Upstream URL: https://bitbucket.org/fenics-project/dolfin
Licenses: LGPL
Groups: fenics-git
Conflicts: dolfin
Submitter: myles
Maintainer: myles
Last Packager: myles
Votes: 7
Popularity: 0.000410
First Submitted: 2013-03-22 22:40
Last Updated: 2015-11-19 23:30

Latest Comments

« First ‹ Previous 1 2 3 4 5 6 7 Next › Last »

Raptorista commented on 2013-10-07 20:17

Please add missing depedencies
[*] eigen3
[*] ffc-git
[*] instant-git

myles commented on 2013-09-16 09:09

bshankar: This is not the place to ask for help. Did you see this: https://answers.launchpad.net/dolfin/+question/224136

Anonymous comment on 2013-09-14 04:57

Getting build errors which compiling this PKGBUILD (see the pastebin below)
http://pastebin.com/YpBvnBJs

Armadillo is not being detected.
I have armadillo installed in /usr . After seeing some forums, I modified the cmake line of PKGBUILD to:

cmake .. -DCMAKE_CXX_COMPILER=/usr/bin/g++ \
-DCMAKE_INSTALL_PREFIX="${pkg}"/usr \
-DPYTHON_EXECUTABLE:PATH="${py2_interp}" \
-DPYTHON_INCLUDE_DIR:PATH="${py2_inc}" \
-DPYTHON_LIBRARY:FILEPATH="${py2_lib}" \
-DDOLFIN_ENABLE_VTK=ON \
-DCMAKE_SKIP_BUILD_RPATH=TRUE \
-DCMAKE_SKIP_RPATH=TRUE \
-DCMAKE_VERBOSE_MAKEFILE=ON \
-DARMADILLO_DIR=/usr \
-DARMADILLO_INCLUDE_DIRS=${ARMADILLO_DIR}/include \
-DARMADILLO_LIBRARIES=${ARMADILLO_DIR}/lib/libarmadillo.so \
-DCMAKE_BUILD_TYPE="Debug"

It made no difference.
Please help!

myles commented on 2013-08-07 21:26

Thanks megavolts I have made some changes.

Anonymous comment on 2013-07-11 19:23

This morning I installed dolfin-git from AUR on a new clean archlinux and ran in several errors, which come from missing dependencies. But I finally went through it.

"Error message" [SOLUTION] :
1) "Could not find a configuration file for package UFC that is compatible with requested version 2.2.0." [install ufc-git]
2)"ARMADILLO_LIBRARIES ARMADILLO_INCLUDE_DIRS ARMADILLO_TEST_RUNSARMADILLO_VERSION ARMADILLO_VERSION_OK) (Required is at least version"2.4.2"" [install armadillo packages]
3) "sh: ffc: command not found" [install ffc-git fiat-git packages ; fiat-git, ufl-git and ufc-git have to be installed manually as they are required by ffc-git. ffc-git calls package name ufl and ufc package name which do not exit in aur.]
4) "ImportError: No module named instant" [install instant-git]


Therefor I will suggest to update the dependencies, adding the following packages:
- ufc-git
- armadillo
- ffc-git (sub dependencies > fiat-git, ufl-git, ufc-git)
- instant-git

Anonymous comment on 2013-06-11 06:32

Without ffc-git the cmake/scripts/generate* won't work which might result in a compile error due to missing forms (it did here).

myles commented on 2013-02-19 20:23

This pkgbuild is for the bzr trunk, not version 1.1.

Anonymous comment on 2013-02-19 17:58

pkgbuild fails with dolfin 1.1.

Changing _bzrtrunk=lp:dolfin/1.0.x works. The 1.0.x branch is maintained for the time being.

Anonymous comment on 2012-12-15 15:41

Installing dolfin leads to 2 errors:

1) Armadillo issue https://answers.launchpad.net/fenics/+question/206520; I resolved it, probably in a bad hacking style, by copying /usr/lib64/libarmadillo* in /usr/lib/ .

2) cmake error, which I hasn't overcome yet! I report below the CMakeError.log:

Performing C++ SOURCE FILE Test CHOLMOD_TEST_RUNS failed with the following output:
Change Dir: /home/roberto/computer/programs_software/dolfin/dolfin-bzr/src/dolfin-build/build/CMakeFiles/CMakeTmp

Run Build Command:/usr/bin/make "cmTryCompileExec2286648684/fast"
/usr/bin/make -f CMakeFiles/cmTryCompileExec2286648684.dir/build.make CMakeFiles/cmTryCompileExec2286648684.dir/build
make[1]: Entering directory `/home/roberto/computer/programs_software/dolfin/dolfin-bzr/src/dolfin-build/build/CMakeFiles/CMakeTmp'
/usr/bin/cmake -E cmake_progress_report /home/roberto/computer/programs_software/dolfin/dolfin-bzr/src/dolfin-build/build/CMakeFiles/CMakeTmp/CMakeFiles 1
Building CXX object CMakeFiles/cmTryCompileExec2286648684.dir/src.cxx.o
/usr/bin/g++ -DMPICH_IGNORE_CXX_SEEK -DCHOLMOD_TEST_RUNS -fopenmp -o CMakeFiles/cmTryCompileExec2286648684.dir/src.cxx.o -c /home/roberto/computer/programs_software/dolfin/dolfin-bzr/src/dolfin-build/build/CMakeFiles/CMakeTmp/src.cxx
Linking CXX executable cmTryCompileExec2286648684
/usr/bin/cmake -E cmake_link_script CMakeFiles/cmTryCompileExec2286648684.dir/link.txt --verbose=1
/usr/bin/g++ -DMPICH_IGNORE_CXX_SEEK -DCHOLMOD_TEST_RUNS -fopenmp -Wl,--hash-style=gnu -Wl,--as-needed CMakeFiles/cmTryCompileExec2286648684.dir/src.cxx.o -o cmTryCompileExec2286648684 -rdynamic /lib64/libcholmod.a /lib64/libamd.a /lib64/libcamd.a /lib64/libcolamd.a /lib64/libccolamd.a /lib64/libsuitesparseconfig.a /lib64/libparmetis.so /lib64/libmetis.so /lib64/liblapack.so /lib64/libcblas.so /lib64/libf77blas.so /lib64/libatlas.so /lib64/libcblas.so /lib64/libf77blas.so /lib64/libatlas.so /usr/lib/gcc/x86_64-unknown-linux-gnu/4.7.2/../../../../lib/libgfortran.so -Wl,-rpath,/lib64:/usr/lib/gcc/x86_64-unknown-linux-gnu/4.7.2/../../../../lib
/lib64/libsuitesparseconfig.a(SuiteSparse_config.o): In function `SuiteSparse_tic':
(.text+0x131): undefined reference to `clock_gettime'
collect2: error: ld returned 1 exit status
make[1]: *** [cmTryCompileExec2286648684] Error 1
make[1]: Leaving directory `/home/roberto/computer/programs_software/dolfin/dolfin-bzr/src/dolfin-build/build/CMakeFiles/CMakeTmp'
make: *** [cmTryCompileExec2286648684/fast] Error 2

Return value: 1
Source file was:

#include <stdio.h>
#include <cholmod.h>

int main()
{
cholmod_dense *D;
cholmod_sparse *S;
cholmod_dense *x, *b, *r;
cholmod_factor *L;
double one[2] = {1,0}, m1[2] = {-1,0};
double *dx;
cholmod_common c;
int n = 5;
double K[5][5] = {{1.0, 0.0, 0.0, 0.0, 0.0},
{0.0, 2.0,-1.0, 0.0, 0.0},
{0.0,-1.0, 2.0,-1.0, 0.0},
{0.0, 0.0,-1.0, 2.0, 0.0},
{0.0, 0.0, 0.0, 0.0, 1.0}};
cholmod_start (&c);
D = cholmod_allocate_dense(n, n, n, CHOLMOD_REAL, &c);
dx = (double*)D->x;
for (int i=0; i < n; i++)
for (int j=0; j < n; j++)
dx[i+j*n] = K[i][j];
S = cholmod_dense_to_sparse(D, 1, &c);
S->stype = 1;
cholmod_reallocate_sparse(cholmod_nnz(S, &c), S, &c);
b = cholmod_ones(S->nrow, 1, S->xtype, &c);
L = cholmod_analyze(S, &c);
cholmod_factorize(S, L, &c);
x = cholmod_solve(CHOLMOD_A, L, b, &c);
r = cholmod_copy_dense(b, &c);
cholmod_sdmult(S, 0, m1, one, x, r, &c);
cholmod_free_factor(&L, &c);
cholmod_free_dense(&D, &c);
cholmod_free_sparse(&S, &c);
cholmod_free_dense(&r, &c);
cholmod_free_dense(&x, &c);
cholmod_free_dense(&b, &c);
cholmod_finish(&c);
return 0;
}

Performing C++ SOURCE FILE Test UMFPACK_TEST_RUNS failed with the following output:
Change Dir: /home/roberto/computer/programs_software/dolfin/dolfin-bzr/src/dolfin-build/build/CMakeFiles/CMakeTmp

Run Build Command:/usr/bin/make "cmTryCompileExec3575677258/fast"
/usr/bin/make -f CMakeFiles/cmTryCompileExec3575677258.dir/build.make CMakeFiles/cmTryCompileExec3575677258.dir/build
make[1]: Entering directory `/home/roberto/computer/programs_software/dolfin/dolfin-bzr/src/dolfin-build/build/CMakeFiles/CMakeTmp'
/usr/bin/cmake -E cmake_progress_report /home/roberto/computer/programs_software/dolfin/dolfin-bzr/src/dolfin-build/build/CMakeFiles/CMakeTmp/CMakeFiles 1
Building CXX object CMakeFiles/cmTryCompileExec3575677258.dir/src.cxx.o
/usr/bin/g++ -DMPICH_IGNORE_CXX_SEEK -DUMFPACK_TEST_RUNS -fopenmp -o CMakeFiles/cmTryCompileExec3575677258.dir/src.cxx.o -c /home/roberto/computer/programs_software/dolfin/dolfin-bzr/src/dolfin-build/build/CMakeFiles/CMakeTmp/src.cxx
Linking CXX executable cmTryCompileExec3575677258
/usr/bin/cmake -E cmake_link_script CMakeFiles/cmTryCompileExec3575677258.dir/link.txt --verbose=1
/usr/bin/g++ -DMPICH_IGNORE_CXX_SEEK -DUMFPACK_TEST_RUNS -fopenmp -Wl,--hash-style=gnu -Wl,--as-needed CMakeFiles/cmTryCompileExec3575677258.dir/src.cxx.o -o cmTryCompileExec3575677258 -rdynamic /lib64/libumfpack.a /lib64/libamd.a /lib64/libcblas.so /lib64/libf77blas.so /lib64/libatlas.so /lib64/libsuitesparseconfig.a /usr/lib/gcc/x86_64-unknown-linux-gnu/4.7.2/../../../../lib/libgfortran.so -Wl,-rpath,/lib64:/usr/lib/gcc/x86_64-unknown-linux-gnu/4.7.2/../../../../lib
/lib64/libumfpack.a(umf_i_cholmod.o): In function `umf_i_cholmod':
(.text+0x9e): undefined reference to `cholmod_start'
/lib64/libumfpack.a(umf_i_cholmod.o): In function `umf_i_cholmod':
(.text+0x1cd): undefined reference to `cholmod_analyze'
/lib64/libumfpack.a(umf_i_cholmod.o): In function `umf_i_cholmod':
(.text+0x1e4): undefined reference to `cholmod_free_sparse'
/lib64/libumfpack.a(umf_i_cholmod.o): In function `umf_i_cholmod':
(.text+0x298): undefined reference to `cholmod_free_factor'
/lib64/libumfpack.a(umf_i_cholmod.o): In function `umf_i_cholmod':
(.text+0x2b1): undefined reference to `cholmod_print_common'
/lib64/libumfpack.a(umf_i_cholmod.o): In function `umf_i_cholmod':
(.text+0x2be): undefined reference to `cholmod_finish'
/lib64/libumfpack.a(umf_i_cholmod.o): In function `umf_i_cholmod':
(.text+0x440): undefined reference to `cholmod_transpose'
/lib64/libsuitesparseconfig.a(SuiteSparse_config.o): In function `SuiteSparse_tic':
(.text+0x131): undefined reference to `clock_gettime'
collect2: error: ld returned 1 exit status
make[1]: *** [cmTryCompileExec3575677258] Error 1
make[1]: Leaving directory `/home/roberto/computer/programs_software/dolfin/dolfin-bzr/src/dolfin-build/build/CMakeFiles/CMakeTmp'
make: *** [cmTryCompileExec3575677258/fast] Error 2

Return value: 1
Source file was:

/* Test program umfpack-ex1.c */

#include <umfpack.h>

int main()
{
int n = 5;
double x[5];
void *Symbolic, *Numeric;
int i;

int Ap[] = { 0, 2, 5, 9, 10, 12 };
int Ai[] = { 0, 1, 0, 2, 4, 1, 2, 3, 4, 2, 1, 4 };
double Ax[] = { 2, 3, 3, -1, 4, 4, -3, 1, 2, 2, 6, 1 };
double b[] = { 8, 45, -3, 3, 19 };

umfpack_di_symbolic(n, n, Ap, Ai, Ax, &Symbolic, NULL, NULL);
umfpack_di_numeric(Ap, Ai, Ax, Symbolic, &Numeric, NULL, NULL);
umfpack_di_free_symbolic(&Symbolic);

umfpack_di_solve(UMFPACK_A, Ap, Ai, Ax, x, b, Numeric, NULL, NULL);
umfpack_di_free_numeric(&Numeric);

return 0;
}

Performing C++ SOURCE FILE Test PETSC_CUSP_FOUND failed with the following output:
Change Dir: /home/roberto/computer/programs_software/dolfin/dolfin-bzr/src/dolfin-build/build/CMakeFiles/CMakeTmp

Run Build Command:/usr/bin/make "cmTryCompileExec3933088938/fast"
/usr/bin/make -f CMakeFiles/cmTryCompileExec3933088938.dir/build.make CMakeFiles/cmTryCompileExec3933088938.dir/build
make[1]: Entering directory `/home/roberto/computer/programs_software/dolfin/dolfin-bzr/src/dolfin-build/build/CMakeFiles/CMakeTmp'
/usr/bin/cmake -E cmake_progress_report /home/roberto/computer/programs_software/dolfin/dolfin-bzr/src/dolfin-build/build/CMakeFiles/CMakeTmp/CMakeFiles 1
Building CXX object CMakeFiles/cmTryCompileExec3933088938.dir/src.cxx.o
/usr/bin/g++ -DMPICH_IGNORE_CXX_SEEK -DPETSC_CUSP_FOUND -fopenmp -I/opt/petsc/arch-linux2-cxx-opt/include -o CMakeFiles/cmTryCompileExec3933088938.dir/src.cxx.o -c /home/roberto/computer/programs_software/dolfin/dolfin-bzr/src/dolfin-build/build/CMakeFiles/CMakeTmp/src.cxx
Linking CXX executable cmTryCompileExec3933088938
/usr/bin/cmake -E cmake_link_script CMakeFiles/cmTryCompileExec3933088938.dir/link.txt --verbose=1
/usr/bin/g++ -DMPICH_IGNORE_CXX_SEEK -DPETSC_CUSP_FOUND -fopenmp -Wl,--hash-style=gnu -Wl,--as-needed CMakeFiles/cmTryCompileExec3933088938.dir/src.cxx.o -o cmTryCompileExec3933088938 -rdynamic /opt/petsc/arch-linux2-cxx-opt/lib/libpetsc.so /usr/lib/openmpi/libmpi.so -ldl -lhwloc -Wl,-rpath,/opt/petsc/arch-linux2-cxx-opt/lib:/usr/lib/openmpi
make[1]: Leaving directory `/home/roberto/computer/programs_software/dolfin/dolfin-bzr/src/dolfin-build/build/CMakeFiles/CMakeTmp'

Return value: 1
Source file was:

#include "petsc.h"
int main()
{
#if PETSC_HAVE_CUSP
return 0;
#else
return 1;
#endif
}

Determining if the Q_WS_WIN exist failed with the following output:
Change Dir: /home/roberto/computer/programs_software/dolfin/dolfin-bzr/src/dolfin-build/build/CMakeFiles/CMakeTmp

Run Build Command:/usr/bin/make "cmTryCompileExec138763340/fast"
/usr/bin/make -f CMakeFiles/cmTryCompileExec138763340.dir/build.make CMakeFiles/cmTryCompileExec138763340.dir/build
make[1]: Entering directory `/home/roberto/computer/programs_software/dolfin/dolfin-bzr/src/dolfin-build/build/CMakeFiles/CMakeTmp'
/usr/bin/cmake -E cmake_progress_report /home/roberto/computer/programs_software/dolfin/dolfin-bzr/src/dolfin-build/build/CMakeFiles/CMakeTmp/CMakeFiles 1
Building CXX object CMakeFiles/cmTryCompileExec138763340.dir/CheckSymbolExists.cxx.o
/usr/bin/g++ -DMPICH_IGNORE_CXX_SEEK -march=x86-64 -mtune=generic -O2 -pipe -fstack-protector --param=ssp-buffer-size=4 -D_FORTIFY_SOURCE=2 -frounding-math -o CMakeFiles/cmTryCompileExec138763340.dir/CheckSymbolExists.cxx.o -c /home/roberto/computer/programs_software/dolfin/dolfin-bzr/src/dolfin-build/build/CMakeFiles/CMakeTmp/CheckSymbolExists.cxx
/home/roberto/computer/programs_software/dolfin/dolfin-bzr/src/dolfin-build/build/CMakeFiles/CMakeTmp/CheckSymbolExists.cxx: In function ‘int main(int, char**)’:
/home/roberto/computer/programs_software/dolfin/dolfin-bzr/src/dolfin-build/build/CMakeFiles/CMakeTmp/CheckSymbolExists.cxx:8:19: error: ‘Q_WS_WIN’ was not declared in this scope
make[1]: *** [CMakeFiles/cmTryCompileExec138763340.dir/CheckSymbolExists.cxx.o] Error 1
make[1]: Leaving directory `/home/roberto/computer/programs_software/dolfin/dolfin-bzr/src/dolfin-build/build/CMakeFiles/CMakeTmp'
make: *** [cmTryCompileExec138763340/fast] Error 2

File /home/roberto/computer/programs_software/dolfin/dolfin-bzr/src/dolfin-build/build/CMakeFiles/CMakeTmp/CheckSymbolExists.cxx:
/* */
#include <QtCore/qglobal.h>

int main(int argc, char** argv)
{
(void)argv;
#ifndef Q_WS_WIN
return ((int*)(&Q_WS_WIN))[argc];
#else
(void)argc;
return 0;
#endif
}

Determining if the Q_WS_QWS exist failed with the following output:
Change Dir: /home/roberto/computer/programs_software/dolfin/dolfin-bzr/src/dolfin-build/build/CMakeFiles/CMakeTmp

Run Build Command:/usr/bin/make "cmTryCompileExec2065892581/fast"
/usr/bin/make -f CMakeFiles/cmTryCompileExec2065892581.dir/build.make CMakeFiles/cmTryCompileExec2065892581.dir/build
make[1]: Entering directory `/home/roberto/computer/programs_software/dolfin/dolfin-bzr/src/dolfin-build/build/CMakeFiles/CMakeTmp'
/usr/bin/cmake -E cmake_progress_report /home/roberto/computer/programs_software/dolfin/dolfin-bzr/src/dolfin-build/build/CMakeFiles/CMakeTmp/CMakeFiles 1
Building CXX object CMakeFiles/cmTryCompileExec2065892581.dir/CheckSymbolExists.cxx.o
/usr/bin/g++ -DMPICH_IGNORE_CXX_SEEK -march=x86-64 -mtune=generic -O2 -pipe -fstack-protector --param=ssp-buffer-size=4 -D_FORTIFY_SOURCE=2 -frounding-math -o CMakeFiles/cmTryCompileExec2065892581.dir/CheckSymbolExists.cxx.o -c /home/roberto/computer/programs_software/dolfin/dolfin-bzr/src/dolfin-build/build/CMakeFiles/CMakeTmp/CheckSymbolExists.cxx
/home/roberto/computer/programs_software/dolfin/dolfin-bzr/src/dolfin-build/build/CMakeFiles/CMakeTmp/CheckSymbolExists.cxx: In function ‘int main(int, char**)’:
/home/roberto/computer/programs_software/dolfin/dolfin-bzr/src/dolfin-build/build/CMakeFiles/CMakeTmp/CheckSymbolExists.cxx:8:19: error: ‘Q_WS_QWS’ was not declared in this scope
make[1]: *** [CMakeFiles/cmTryCompileExec2065892581.dir/CheckSymbolExists.cxx.o] Error 1
make[1]: Leaving directory `/home/roberto/computer/programs_software/dolfin/dolfin-bzr/src/dolfin-build/build/CMakeFiles/CMakeTmp'
make: *** [cmTryCompileExec2065892581/fast] Error 2

File /home/roberto/computer/programs_software/dolfin/dolfin-bzr/src/dolfin-build/build/CMakeFiles/CMakeTmp/CheckSymbolExists.cxx:
/* */
#include <QtCore/qglobal.h>

int main(int argc, char** argv)
{
(void)argv;
#ifndef Q_WS_QWS
return ((int*)(&Q_WS_QWS))[argc];
#else
(void)argc;
return 0;
#endif
}

Determining if the Q_WS_MAC exist failed with the following output:
Change Dir: /home/roberto/computer/programs_software/dolfin/dolfin-bzr/src/dolfin-build/build/CMakeFiles/CMakeTmp

Run Build Command:/usr/bin/make "cmTryCompileExec3070239012/fast"
/usr/bin/make -f CMakeFiles/cmTryCompileExec3070239012.dir/build.make CMakeFiles/cmTryCompileExec3070239012.dir/build
make[1]: Entering directory `/home/roberto/computer/programs_software/dolfin/dolfin-bzr/src/dolfin-build/build/CMakeFiles/CMakeTmp'
/usr/bin/cmake -E cmake_progress_report /home/roberto/computer/programs_software/dolfin/dolfin-bzr/src/dolfin-build/build/CMakeFiles/CMakeTmp/CMakeFiles 1
Building CXX object CMakeFiles/cmTryCompileExec3070239012.dir/CheckSymbolExists.cxx.o
/usr/bin/g++ -DMPICH_IGNORE_CXX_SEEK -march=x86-64 -mtune=generic -O2 -pipe -fstack-protector --param=ssp-buffer-size=4 -D_FORTIFY_SOURCE=2 -frounding-math -o CMakeFiles/cmTryCompileExec3070239012.dir/CheckSymbolExists.cxx.o -c /home/roberto/computer/programs_software/dolfin/dolfin-bzr/src/dolfin-build/build/CMakeFiles/CMakeTmp/CheckSymbolExists.cxx
/home/roberto/computer/programs_software/dolfin/dolfin-bzr/src/dolfin-build/build/CMakeFiles/CMakeTmp/CheckSymbolExists.cxx: In function ‘int main(int, char**)’:
/home/roberto/computer/programs_software/dolfin/dolfin-bzr/src/dolfin-build/build/CMakeFiles/CMakeTmp/CheckSymbolExists.cxx:8:19: error: ‘Q_WS_MAC’ was not declared in this scope
make[1]: *** [CMakeFiles/cmTryCompileExec3070239012.dir/CheckSymbolExists.cxx.o] Error 1
make[1]: Leaving directory `/home/roberto/computer/programs_software/dolfin/dolfin-bzr/src/dolfin-build/build/CMakeFiles/CMakeTmp'
make: *** [cmTryCompileExec3070239012/fast] Error 2

File /home/roberto/computer/programs_software/dolfin/dolfin-bzr/src/dolfin-build/build/CMakeFiles/CMakeTmp/CheckSymbolExists.cxx:
/* */
#include <QtCore/qglobal.h>

int main(int argc, char** argv)
{
(void)argv;
#ifndef Q_WS_MAC
return ((int*)(&Q_WS_MAC))[argc];
#else
(void)argc;
return 0;
#endif
}

myles commented on 2012-12-11 23:12

All the pkgbuild scripts that I maintain that are relevent for fenics are available at https://github.com/mylese/fenics-arch.git