Warning: file_exists(): open_basedir restriction in effect. File(/srv/http/vhosts/aur.archlinux.org/public/web/locale//en/LC_MESSAGES/aurweb.mo) is not within the allowed path(s): (/srv/http/vhosts/aur-dev.archlinux.org/:/etc/aurweb/) in /srv/http/vhosts/aur-dev.archlinux.org/public/web/lib/streams.php on line 90
AUR (en) - conky-nvidia

Notice: Undefined variable: name in /srv/http/vhosts/aur-dev.archlinux.org/public/web/lib/pkgfuncs.inc.php on line 248

Package Details: conky-nvidia 1.10.6-1

Git Clone URL: https://aur-dev.archlinux.org/conky-nvidia.git (read-only)
Package Base: conky-nvidia
Description: Lightweight system monitor for X
Upstream URL: http://conky.sourceforge.net/
Licenses: GPL, BSD
Conflicts: conky
Provides: conky
Submitter: None
Maintainer: sakalisc
Last Packager: sakalisc
Votes: 116
Popularity: 1.615773
First Submitted: 2008-08-17 12:22
Last Updated: 2016-12-07 18:30

Latest Comments

« First ‹ Previous ... 3 4 5 6 7 8

ugaciaka commented on 2010-11-07 10:10

@tassadar
tnx!!!

tasidus commented on 2010-11-07 10:01

http://aur.pastebin.com/KnAHgN3R

ugaciaka commented on 2010-11-07 06:56

@tassadar

can you rewrite PKGBUILD please? I don't understand whow to apply a patch

tasidus commented on 2010-11-07 00:12

Try this patch :
http://sources.gentoo.org/cgi-bin/viewvc.cgi/gentoo-x86/app-admin/conky/files/conky-1.8.1-nvidia-x.patch?revision=1.1

worked for me

graysky commented on 2010-10-23 12:32

+1 version 1.8.1 does not compile.

ugaciaka commented on 2010-10-08 17:39

I can't compile for nvidia users. Conky 1.8.1 have this error

y-nvidia.o -MD -MP -MF .deps/conky-nvidia.Tpo -c -o conky-nvidia.o `test -f 'nvidia.c' || echo './'`nvidia.c
nvidia.c: In function ‘get_nvidia_value’:
nvidia.c:63:41: error: ‘display’ undeclared (first use in this function)
nvidia.c:63:41: note: each undeclared identifier is reported only once for each function it appears in
make[2]: *** [conky-nvidia.o] Error 1
make[2]: *** Waiting for unfinished jobs....
mv -f .deps/conky-prss.Tpo .deps/conky-prss.Po
make[2]: Leaving directory `/home/ugaciaka/Source/abs/extra/conky/src/conky-1.8.1/src'
make[1]: *** [all] Error 2
make[1]: Leaving directory `/home/ugaciaka/Source/abs/extra/conky/src/conky-1.8.1/src'
make: *** [all-recursive] Error 1
L'operazione sta per essere interrotta...