Warning: file_exists(): open_basedir restriction in effect. File(/srv/http/vhosts/aur.archlinux.org/public/web/locale//en/LC_MESSAGES/aurweb.mo) is not within the allowed path(s): (/srv/http/vhosts/aur-dev.archlinux.org/:/etc/aurweb/) in /srv/http/vhosts/aur-dev.archlinux.org/public/web/lib/streams.php on line 90
AUR (en) - clementine-git

Notice: Undefined variable: name in /srv/http/vhosts/aur-dev.archlinux.org/public/web/lib/pkgfuncs.inc.php on line 248

Package Details: clementine-git 1.3.1.r245.g5e7dd00-1

Git Clone URL: https://aur-dev.archlinux.org/clementine-git.git (read-only)
Package Base: clementine-git
Description: A modern music player and library organizer
Upstream URL: http://www.clementine-player.org/
Licenses: GPL
Submitter: archdria
Maintainer: eduardosm
Last Packager: eduardosm
Votes: 80
Popularity: 1.163013
First Submitted: 2011-07-19 22:38
Last Updated: 2016-11-27 10:30

Dependencies (33)

Required by (0)

Sources (1)

Latest Comments

1 2 3 4 5 6 ... Next › Last »

eduardosm commented on 2016-11-27 10:30

@j605 Done

j605 commented on 2016-11-27 09:40

Can you remove libechonest from dependency list as upstream has removed it.

xiong.chiamiov commented on 2016-02-29 23:22

1.3 RC shouldn't matter, since this package builds from git HEAD. The version number is autogenerated from git-describe.

varlesh commented on 2016-02-06 21:11

1.3 RC version?

NOTtheMessiah commented on 2016-01-16 09:01

I'm getting issues when I try to compile with protobuf3:

../libclementine-tagreader/liblibclementine-tagreader.a(tagreader.cpp.o):tagreader.cpp:(.text+0x3861): more undefined references to `google::protobuf::internal::empty_string_[abi:cxx11]' follow
collect2: error: ld returned 1 exit status
ext/clementine-tagreader/CMakeFiles/clementine-tagreader.dir/build.make:159: recipe for target 'clementine-tagreader' failed
make[2]: *** [clementine-tagreader] Error 1
CMakeFiles/Makefile2:2293: recipe for target 'ext/clementine-tagreader/CMakeFiles/clementine-tagreader.dir/all' failed
make[1]: *** [ext/clementine-tagreader/CMakeFiles/clementine-tagreader.dir/all] Error 2
Makefile:127: recipe for target 'all' failed
make: *** [all] Error 2

xiong.chiamiov commented on 2015-12-17 17:33

To get this working with Spotify, I had to pull the protobuf PKGBUILD out of ABS and add options=('staticlibs') to prevent it from stripping the static library that clementine wants.

Chocobozzz commented on 2015-05-05 10:18

The hack is not needed anymore, fixed in the master branch (https://github.com/clementine-player/Clementine/commit/082a1d3e94aee5deaef639cfc8f57348570816d0) :)

archdria commented on 2015-04-29 19:27

Updated, thanks :)

post-factum commented on 2015-04-29 18:32

Consider adding the following command to PKGBUILD (before calling make) to fix crypto++ issue:

sed -i 's/crypto++/cryptopp/g' ${srcdir}/Clementine/src/internet/spotify/spotifyblobdownloader.cpp

ryuzy commented on 2015-04-29 08:24

I think in src/internet/spotify/spotifyblobdownloader.cpp
#include <crypto++/pkcspad.h>
#include <crypto++/rsa.h>

Should be edited to:
#include <cryptopp/pkcspad.h>
#include <cryptopp/rsa.h>