Warning: file_exists(): open_basedir restriction in effect. File(/srv/http/vhosts/aur.archlinux.org/public/web/locale//en/LC_MESSAGES/aurweb.mo) is not within the allowed path(s): (/srv/http/vhosts/aur-dev.archlinux.org/:/etc/aurweb/) in /srv/http/vhosts/aur-dev.archlinux.org/public/web/lib/streams.php on line 90
AUR (en) - carla-git

Notice: Undefined variable: name in /srv/http/vhosts/aur-dev.archlinux.org/public/web/lib/pkgfuncs.inc.php on line 248

Package Details: carla-git 1.9.7.r6.g3075aa2c-1

Git Clone URL: https://aur-dev.archlinux.org/carla-git.git (read-only)
Package Base: carla-git
Description: Audio Plugin Host
Upstream URL: http://kxstudio.sf.net/carla
Licenses: GPL2
Conflicts: carla
Provides: carla
Submitter: cocreature
Maintainer: cocreature
Last Packager: cocreature
Votes: 14
Popularity: 0.732449
First Submitted: 2013-10-11 12:29
Last Updated: 2017-01-06 12:38

Latest Comments

« First ‹ Previous 1 2 3 4 5 6 Next › Last »

cocreature commented on 2014-12-03 19:00

Sorry for having missed your comment jarch-jarch
This is going to get fixed upstream in the next days. I won't update the package with a workaround as you shouldn't use it right now anyway. That's what you get for wanting to use the git version :D

SpotlightKid commented on 2014-12-03 18:46

Yes, I also get this. There's an error in the top-level Makefile in the repo. I fixed this in my PKGBUILD by adding:

prepare() {
cd "$srcdir/$pkgname"
sed -i -e 's@source/modules/CarlaNative.h@source/includes/CarlaNative.h@' \
Makefile
}

jarch-jarch commented on 2014-11-13 05:06

Getting this error on both 64 and 32 builds:

Makefile:118: recipe for target 'JackBridgeExport.cpp.win32e.o' failed
make[1]: *** [JackBridgeExport.cpp.win32e.o] Error 1
make[1]: Leaving directory '/tmp/yaourt-tmp-j/aur-carla-bridges-win32-git/src/carla-bridges-win32-git/source/modules/jackbridge'
Makefile:99: recipe for target 'source/modules/jackbridge.win32e.a' failed
make: *** [source/modules/jackbridge.win32e.a] Error 2
==> ERROR: A failure occurred in build().
Aborting...
==> ERROR: Makepkg was unable to build carla-bridges-win32-git.

Saw down the comments someone else had something similar but it was a problem with the Carla package or something? Anyone else getting it? Thanks.

cocreature commented on 2014-11-02 17:36

It's not my fault if namcap is wrong.
python-pyqt4 is needed (try removing it, if you don't believe me) and it already has python3 as a dependency so there's no need to specify this again. libmagic is in file and file is in the base-devel group which should always be installed if you want to use the aur and those packages should not be included in the dependencies.

SpotlightKid commented on 2014-11-02 17:18

namcap has the following complaints:

carla-git W: Referenced library 'python3\n#' is an uninstalled dependency
carla-git E: Dependency file detected and not included (libraries ['usr/lib/libmagic.so.1'] needed in files ['usr/lib/vst/carla.vst/CarlaRackFX.so', 'usr/lib/lv2/carla.lv2/carla.so', 'usr/lib/vst/carla.vst/CarlaRack.so', 'usr/lib/carla/libcarla_standalone2.so', 'usr/lib/vst/carla.vst/CarlaPatchbayFX.so', 'usr/lib/vst/carla.vst/CarlaPatchbay.so'])
carla-git W: Dependency included and not needed ('python-pyqt4')

cocreature commented on 2014-07-11 22:00

and updated again.

sekret commented on 2014-07-11 18:54

Confirmed!

Just recognized, your optional dependency zynaddsubfx-g2it doesn't exist. Looks like a typo to me.

cocreature commented on 2014-07-09 18:21

Should work now according to falktx and does so on my machine.

sekret commented on 2014-07-09 17:38

Doesn't build here either.

[snip]
../backend/engine/CarlaEngine.cpp: In member function ‘bool CarlaBackend::CarlaEngine::removePlugin(uint)’:
../backend/engine/CarlaEngine.cpp:625:39: error: ‘kEnginePostActionRemovePlugin’ was not declared in this scope
const ScopedActionLock sal(pData, kEnginePostActionRemovePlugin, id, 0, lockWait);
^
../backend/engine/CarlaEngine.cpp: In member function ‘bool CarlaBackend::CarlaEngine::switchPlugins(uint, uint)’:
../backend/engine/CarlaEngine.cpp:783:39: error: ‘kEnginePostActionSwitchPlugins’ was not declared in this scope
const ScopedActionLock sal(pData, kEnginePostActionSwitchPlugins, idA, idB, lockWait);
^
Makefile:536: recipe for target '../backend/engine/CarlaEngine__native.o' failed
make[1]: *** [../backend/engine/CarlaEngine__native.o] Error 1
make[1]: Leaving directory '/home/sekret/Programme/Eigenbau/carla-git/src/carla-git/source/bridges'
Makefile:108: recipe for target 'bin/carla-bridge-native' failed
make: *** [bin/carla-bridge-native] Error 2
==> ERROR: A failure occurred in build().
Aborting...

cocreature commented on 2014-07-09 08:03

Thx updated, doesn't build currently but I'm pretty sure that this is not a problem of the pkgbuild but of carla. I'll contact falktx.