Warning: file_exists(): open_basedir restriction in effect. File(/srv/http/vhosts/aur.archlinux.org/public/web/locale//en/LC_MESSAGES/aurweb.mo) is not within the allowed path(s): (/srv/http/vhosts/aur-dev.archlinux.org/:/etc/aurweb/) in /srv/http/vhosts/aur-dev.archlinux.org/public/web/lib/streams.php on line 90
AUR (en) - carla-git

Notice: Undefined variable: name in /srv/http/vhosts/aur-dev.archlinux.org/public/web/lib/pkgfuncs.inc.php on line 248

Package Details: carla-git 1.9.7.r6.g3075aa2c-1

Git Clone URL: https://aur-dev.archlinux.org/carla-git.git (read-only)
Package Base: carla-git
Description: Audio Plugin Host
Upstream URL: http://kxstudio.sf.net/carla
Licenses: GPL2
Conflicts: carla
Provides: carla
Submitter: cocreature
Maintainer: cocreature
Last Packager: cocreature
Votes: 14
Popularity: 0.732449
First Submitted: 2013-10-11 12:29
Last Updated: 2017-01-06 12:38

Latest Comments

« First ‹ Previous 1 2 3 4 5 6 Next › Last »

SpotlightKid commented on 2015-08-27 21:55

Works for me. Something wrong with your libpng?

Ralf_Mardorf commented on 2015-08-27 21:42

Hi,

build fails:

[snip]
Creating theme.qt4.a
make[1]: Leaving directory '/tmp/yaourt-tmp-rocketmouse/aur-carla-git/src/carla-git/source/theme'
Linking zynaddsubfx-ui
Linking at1-ui
/usr/bin/ld: ../../build/native-plugins/Release/zita-at1-ui.cpp.o: undefined reference to symbol 'png_set_longjmp_fn@@PNG16_0'
/usr/lib/libpng16.so.16: error adding symbols: DSO missing from command line
collect2: error: ld returned 1 exit status
Makefile:201: recipe for target 'resources/at1-ui' failed
make[1]: *** [resources/at1-ui] Error 1
[snip]
Makefile:103: recipe for target '/tmp/yaourt-tmp-rocketmouse/aur-carla-git/src/carla-git/build/modules/Release/native-plugins.a' failed
make: *** [/tmp/yaourt-tmp-rocketmouse/aur-carla-git/src/carla-git/build/modules/Release/native-plugins.a] Error 2
[snip]
==> ERROR: A failure occurred in build().
Aborting...
==> ERROR: Makepkg was unable to build carla-git.

Ralf_Mardorf commented on 2015-08-27 21:36

Creating theme.qt4.a
make[1]: Leaving directory '/tmp/yaourt-tmp-rocketmouse/aur-carla-git/src/carla-git/source/theme'
Linking zynaddsubfx-ui
Linking at1-ui
/usr/bin/ld: ../../build/native-plugins/Release/zita-at1-ui.cpp.o: undefined reference to symbol 'png_set_longjmp_fn@@PNG16_0'
/usr/lib/libpng16.so.16: error adding symbols: DSO missing from command line
collect2: error: ld returned 1 exit status
Makefile:201: recipe for target 'resources/at1-ui' failed
make[1]: *** [resources/at1-ui] Error 1
make[1]: *** Waiting for unfinished jobs....
make[1]: Entering directory '/tmp/yaourt-tmp-rocketmouse/aur-carla-git/src/carla-git/source/theme'
Generating moc_CarlaStyle.qt5.cpp
Generating moc_CarlaStyleAnimations.qt5.cpp
Generating moc_CarlaStylePlugin.qt5.cpp
Generating moc_CarlaStylePrivate.qt5.cpp
Generating resources.qt5.cpp
Compiling CarlaStyle.cpp (Qt5)
Compiling moc_CarlaStyle.cpp (Qt5)
Compiling moc_CarlaStyleAnimations.cpp (Qt5)
Compiling moc_CarlaStylePrivate.cpp (Qt5)
Compiling resources.cpp (Qt5)
Creating theme.qt5.a
make[1]: Leaving directory '/tmp/yaourt-tmp-rocketmouse/aur-carla-git/src/carla-git/source/theme'
make[1]: Entering directory '/tmp/yaourt-tmp-rocketmouse/aur-carla-git/src/carla-git/source/interposer'
make[1]: Leaving directory '/tmp/yaourt-tmp-rocketmouse/aur-carla-git/src/carla-git/source/native-plugins'
Makefile:103: recipe for target '/tmp/yaourt-tmp-rocketmouse/aur-carla-git/src/carla-git/build/modules/Release/native-plugins.a' failed
make: *** [/tmp/yaourt-tmp-rocketmouse/aur-carla-git/src/carla-git/build/modules/Release/native-plugins.a] Error 2
make: *** Waiting for unfinished jobs....
Compiling interposer-safe.cpp
Compiling interposer-x11.cpp
Linking libcarla_interposer-x11.so
Linking libcarla_interposer-safe.so
make[1]: Leaving directory '/tmp/yaourt-tmp-rocketmouse/aur-carla-git/src/carla-git/source/interposer'
==> ERROR: A failure occurred in build().
Aborting...
==> ERROR: Makepkg was unable to build carla-git.

WoefulDerelict commented on 2015-07-16 22:34

The .install file is looking a tad sparse.

cocreature commented on 2015-05-19 19:19

works for me™ (allright I told upstream about it and he fixed it). Please report such bugs upstream, this is definitely not a fault of the aur package. If it worked outside you did use different options or something like that.

nlehmann commented on 2015-05-19 17:59

I also noticed that the source compiles when downloaded directly from the git repo but fails when the dependencies of this package are installed.

SpotlightKid commented on 2015-05-19 17:57

@nlehmann: I can reproduce this, but errors in the codebase are better reported in the Carla issue tracker on Github.

nlehmann commented on 2015-05-19 17:45

I get the following error when trying to compile

In file included from zynaddsubfx-src.cpp:58:0:
zynaddsubfx/DSP/SVFilter.cpp: In member function ‘void SVFilter::singlefilterout(float*, SVFilter::fstage&, SVFilter::parameters&)’:
zynaddsubfx/DSP/SVFilter.cpp:144:70: error: ‘errx’ was not declared in this scope
errx(1, "Impossible SVFilter type encountered [%d]", type);
^
In file included from zynaddsubfx-src.cpp:59:0:
zynaddsubfx/DSP/Unison.cpp: In member function ‘void Unison::updateParameters()’:
zynaddsubfx/DSP/Unison.cpp:112:54: error: ‘warnx’ was not declared in this scope
warnx("BUG: Unison amplitude samples too big");
^
Makefile:300: recipe for target '../../build/native-plugins/Release/zynaddsubfx-src.cpp.o' failed
make[1]: *** [../../build/native-plugins/Release/zynaddsubfx-src.cpp.o] Error 1
make[1]: Leaving directory '/home/nlehmann/AUR/carla-git/src/carla-git/source/native-plugins'
Makefile:102: recipe for target '/home/nlehmann/AUR/carla-git/src/carla-git/build/modules/Release/native-plugins.a' failed
make: *** [/home/nlehmann/AUR/carla-git/src/carla-git/build/modules/Release/native-plugins.a] Error 2

cocreature commented on 2015-04-29 05:36

I updated the package to use git tags. Your aur helper probably won't pick that update up so you need to manually update one time. Sorry for that. Also experimental plugins are now also built.

SpotlightKid commented on 2014-12-03 19:00

(Remove previous version of this comment, where I mistakenly referred to this being the same error as in the comment below.)

There's an error in the top-level Makefile in the repo. I fixed this in my PKGBUILD by adding:

prepare() {
cd "$srcdir/$pkgname"
sed -i -e 's@source/modules/CarlaNative.h@source/includes/CarlaNative.h@' \
Makefile
}