Notice: Undefined variable: name in /srv/http/vhosts/ on line 248

Package Details: broadcom-wl-ck

Git Clone URL: (read-only)
Package Base: broadcom-wl-ck
Description: Broadcom 802.11abgn hybrid Linux networking device driver for linux-ck.
Upstream URL:
Licenses: custom
Submitter: graysky
Maintainer: graysky
Last Packager: graysky
Votes: 18
Popularity: 0.252398
First Submitted: 2011-05-04 22:49
Last Updated: 2017-02-01 21:37

Latest Comments

1 2 3 4 5 6 ... Next › Last »

graysky commented on 2016-12-05 22:09

@Raimar - Thanks for the heads-up. Updated in

Raimar commented on 2016-12-05 21:12

Download URLs have been changed:
See, e.g.

graysky commented on 2016-10-20 18:54

My bad... sums updated in Thank you for reporting.

kogone commented on 2016-10-20 18:29


VerruckteFuchs commented on 2016-10-20 01:41

I'm getting a "==> ERROR: Integrity checks (sha256) differ in size from the source array." when trying to update from to I've tried deleting the broadcom-wl-ck folder from my pacaur cache so I pull in a fresh source, but it doesn't help.

graysky commented on 2015-11-15 20:23

I am unable to build this on i686 (it's fine under x86_64)... Will begin searching for a fix now but always like to inform users and solicite feedback:

make: Entering directory '/usr/lib/modules/4.3.0-1-ck/build'
CFG80211 API is prefered for this kernel version
Using CFG80211 API
LD /home/facade/broadcom-wl-ck/src/built-in.o
CC [M] /home/facade/broadcom-wl-ck/src/src/shared/linux_osl.o
/home/facade/broadcom-wl-ck/src/src/shared/linux_osl.c: In function ‘osl_getcycles’:
/home/facade/broadcom-wl-ck/src/src/shared/linux_osl.c:935:2: error: implicit declaration of function ‘rdtscl’ [-Werror=implicit-function-declaration]
/home/facade/broadcom-wl-ck/src/src/shared/linux_osl.c:935:2: warning: ‘cycles’ is used uninitialized in this function [-Wuninitialized]
cc1: some warnings being treated as errors
scripts/ recipe for target '/home/facade/broadcom-wl-ck/src/src/shared/linux_osl.o' failed
make[1]: *** [/home/facade/broadcom-wl-ck/src/src/shared/linux_osl.o] Error 1
Makefile:1382: recipe for target '_module_/home/facade/broadcom-wl-ck/src' failed
make: *** [_module_/home/facade/broadcom-wl-ck/src] Error 2
make: Leaving directory '/usr/lib/modules/4.3.0-1-ck/build'
==> ERROR: A failure occurred in build().

graysky commented on 2015-11-04 20:35

@Ashish - Glad it's working for you. Enjoy!

Ashish-Bansal commented on 2015-11-04 07:10

@graysky It works perfectly, no bugs at all. Now no more disconnects which I faced in last version :D

graysky commented on 2015-11-03 18:13

Please report back with problems if any ... I do not have this hardware any more.

Ashish-Bansal commented on 2015-11-03 18:04

Thanks graysky :)