Warning: file_exists(): open_basedir restriction in effect. File(/srv/http/vhosts/aur.archlinux.org/public/web/locale//en/LC_MESSAGES/aurweb.mo) is not within the allowed path(s): (/srv/http/vhosts/aur-dev.archlinux.org/:/etc/aurweb/) in /srv/http/vhosts/aur-dev.archlinux.org/public/web/lib/streams.php on line 90
AUR (en) - bomi

Notice: Undefined variable: name in /srv/http/vhosts/aur-dev.archlinux.org/public/web/lib/pkgfuncs.inc.php on line 248

Package Details: bomi 0.9.11-4

Git Clone URL: https://aur-dev.archlinux.org/bomi.git (read-only)
Package Base: bomi
Description: Powerful and easy-to-use GUI multimedia player based on mpv
Upstream URL: http://bomi-player.github.io
Licenses: GPL2
Conflicts: bomi-fresh, bomi-git
Provides: cmplayer
Submitter: xylosper
Maintainer: itsme
Last Packager: itsme
Votes: 88
Popularity: 2.419974
First Submitted: 2015-01-18 00:18
Last Updated: 2016-09-22 14:59

Dependencies (32)

Required by (0)

Sources (2)

Latest Comments

« First ‹ Previous 1 2 3 4 5 Next › Last »

mokkurkalve commented on 2016-02-28 10:04

Build (on X86_64) now fails with:

(...snip...)
logoption.o release/release/moc_logviewer.o release/release/moc_os.o release/release/moc_formatobject.o release/release/moc_checklistwidget.o release/release/moc_videocolordialog.o release/release/moc_algorithmobject.o release/release/moc_mrlstate_old.o release/release/moc_smbauth.o release/release/moc_fontcombobox.o release/release/moc_jrserver.o release/release/moc_windowsize.o release/release/moc_videopreview.o release/release/moc_triangleitem.o release/release/moc_visualizer.o release/release/moc_encoderdialog.o -L/tmp/byggeplass/bomi/src/bomi-0.9.11/src/bomi/../../build/lib -lbz2 -lz /tmp/byggeplass/bomi/src/bomi-0.9.11/build/lib/libmpv.a -lavformat -lavutil -lavcodec -lswscale -lswresample -lavfilter -lass -ldvdread -ldvdnav -lbluray -lchardet -lgobject-2.0 -lglib-2.0 -lxcb-icccm -lxcb-screensaver -lxcb-randr -lxcb-render -lxcb-xtest -lxcb -lX11 -lasound -ljack -lpulse -lcdio_paranoia -lcdio_cdda -lcdio -lm -lsmbclient -lsystemd -lvdpau -lva-glx -lva-x11 -lva -ldl -lQt5Quick -lQt5Svg -lQt5Widgets -lQt5X11Extras -lQt5Gui -lQt5Qml -lQt5Network -lQt5Sql -lQt5Xml -lQt5DBus -lQt5Core -lGL -lpthread
g++: error: /tmp/byggeplass/bomi/src/bomi-0.9.11/build/lib/libmpv.a: No such file or directory
Makefile.Release:1265: recipe for target '../../build/bomi' failed
make[2]: *** [../../build/bomi] Error 1
make[2]: Leaving directory '/tmp/byggeplass/bomi/src/bomi-0.9.11/src/bomi'
Makefile:38: recipe for target 'release' failed
make[1]: *** [release] Error 2
make[1]: Leaving directory '/tmp/byggeplass/bomi/src/bomi-0.9.11/src/bomi'
Makefile:40: recipe for target 'build/build/bomi/bomi' failed
make: *** [build/build/bomi/bomi] Error 2
==> ERROR: A failure occurred in build().
Aborting...

deathtrip commented on 2015-08-10 15:54

Build is failing for me, amongst other errors i get:
Makefile:40: recipe for target 'build/build/bomi/bomi' failed
g++: internal compiler error: Segmentation fault (program cc1plus)

pedrogabriel commented on 2015-08-05 02:08

@xylosper I put the package in aur4.

camsdev commented on 2015-03-27 21:28

It Works! thanks

xylosper commented on 2015-03-26 17:11

@camsdev @pedrogabriel

Updated to 0.9.4. Please try again.

pedrogabriel commented on 2015-03-26 16:54

Build failing...

lrelease src/bomi/translations/*.ts
Updating 'src/bomi/translations/bomi_cs.qm'...
Generated 833 translation(s) (833 finished and 0 unfinished)
Ignored 17 untranslated source text(s)
Updating 'src/bomi/translations/bomi_de.qm'...
Generated 541 translation(s) (441 finished and 100 unfinished)
Ignored 309 untranslated source text(s)
Updating 'src/bomi/translations/bomi_en.qm'...
Generated 0 translation(s) (0 finished and 0 unfinished)
Ignored 850 untranslated source text(s)
Updating 'src/bomi/translations/bomi_es.qm'...
Generated 828 translation(s) (828 finished and 0 unfinished)
Ignored 22 untranslated source text(s)
Updating 'src/bomi/translations/bomi_fi.qm'...
Generated 0 translation(s) (0 finished and 0 unfinished)
Ignored 649 untranslated source text(s)
Updating 'src/bomi/translations/bomi_it.qm'...
Generated 568 translation(s) (466 finished and 102 unfinished)
Ignored 282 untranslated source text(s)
Updating 'src/bomi/translations/bomi_ko.qm'...
Generated 850 translation(s) (850 finished and 0 unfinished)
Updating 'src/bomi/translations/bomi_ru.qm'...
Generated 443 translation(s) (349 finished and 94 unfinished)
Ignored 407 untranslated source text(s)
Updating 'src/bomi/translations/bomi_sr.qm'...
Generated 255 translation(s) (162 finished and 93 unfinished)
Ignored 595 untranslated source text(s)
install -m 644 src/bomi/translations/*.qm build/translations
cd src/bomi && qmake -spec linux-g++ BOMI_RELEASE=1 bomi.pro && make -j4 release
Project ERROR: Unknown module(s) in QT: svg
Makefile:40: recipe for target 'build/build/bomi/bomi' failed
make: *** [build/build/bomi/bomi] Error 3

camsdev commented on 2015-03-26 07:31

build failed in my latest arch machine
here is some output
Checking for libcdio_paranoia libcdio libcdio_cdda ... yes
Checking for smbclient ... yes
Checking for libsystemd ... yes
checking for cc ... gcc
checking for qmake ... qmake
checking for lrelease ... no
'autodetect' failed.

but I already have lrelease. this is result of lrelease -version
lrelease 버전 5.4.1
and this is qmake one
QMake version 3.0
Using Qt version 5.4.1 in /usr/lib
so I checkout detect_qt5() in configure file and fixed this problem by changing LANG=en_GB.UTF-8 to LC_MESSAGES=en_GB.UTF-8

xylosper commented on 2015-03-20 11:49

Please post full build log.

tm4ig commented on 2015-03-20 09:11

I have the same problem .../src/bomi-0.9.3/build/lib/libmpv.a: No such file or directory

DaVinci42 commented on 2015-03-19 07:50

works great, thanks!