Warning: file_exists(): open_basedir restriction in effect. File(/srv/http/vhosts/aur.archlinux.org/public/web/locale//en/LC_MESSAGES/aurweb.mo) is not within the allowed path(s): (/srv/http/vhosts/aur-dev.archlinux.org/:/etc/aurweb/) in /srv/http/vhosts/aur-dev.archlinux.org/public/web/lib/streams.php on line 90
AUR (en) - bitcoind-unlimited-git

Notice: Undefined variable: name in /srv/http/vhosts/aur-dev.archlinux.org/public/web/lib/pkgfuncs.inc.php on line 248

Package Details: bitcoind-unlimited-git 0.12.1-1

Git Clone URL: https://aur-dev.archlinux.org/bitcoind-unlimited-git.git (read-only)
Package Base: bitcoind-unlimited-git
Description: Bitcoin Unlimited versions of bitcoind, bitcoin-cli, and bitcoin-tx
Upstream URL: http://www.bitcoinunlimited.info
Licenses: MIT
Conflicts: bitcoin, bitcoin-cli, bitcoin-daemon, bitcoin-qt, bitcoin-tx, bitcoin-unlimited
Provides: bitcoin, bitcoin-cli, bitcoin-daemon, bitcoin-tx, bitcoin-unlimited
Submitter: uncle
Maintainer: redfish
Last Packager: redfish
Votes: 2
Popularity: 0.177917
First Submitted: 2015-12-31 03:33
Last Updated: 2016-10-08 23:57

Latest Comments

tuxayo commented on 2016-12-23 19:14

**EDIT: never mind, it was out of memory errors that started to happen every time. The build might have begun heavier or my server has less free RAM than before. Anyway, nothing wrong with this package**

Does anyone else get an "internal compiler error" ?

Here are the lasts lines of the output:

{standard input}: Assembler messages:
{standard input}:165037: Warning: end of file not at end of a line; newline inserted
g++: internal compiler error: Killed (program cc1plus)
Please submit a full bug report,
with preprocessed source if appropriate.
See <https://bugs.archlinux.org/> for instructions.
make[2]: *** [Makefile:3921: libbitcoin_server_a-main.o] Error 4
make[2]: Leaving directory '/tmp/yaourt-tmp-ub/aur-bitcoind-unlimited-git/src/BitcoinUnlimited/src'
make[1]: *** [Makefile:7208: all-recursive] Error 1
make[1]: Leaving directory '/tmp/yaourt-tmp-ub/aur-bitcoind-unlimited-git/src/BitcoinUnlimited/src'
make: *** [Makefile:649: all-recursive] Error 1
==> ERROR: A failure occurred in build().
Aborting...
==> ERROR: Makepkg was unable to build bitcoind-unlimited-git.

uncle commented on 2016-03-06 18:57

@ERamseth branch 0.12bu is still experimental.

ERamseth commented on 2016-02-26 22:13

should update to use branch 0.12bu