Warning: file_exists(): open_basedir restriction in effect. File(/srv/http/vhosts/aur.archlinux.org/public/web/locale//en/LC_MESSAGES/aurweb.mo) is not within the allowed path(s): (/srv/http/vhosts/aur-dev.archlinux.org/:/etc/aurweb/) in /srv/http/vhosts/aur-dev.archlinux.org/public/web/lib/streams.php on line 90
AUR (en) - authsae-git

Notice: Undefined variable: name in /srv/http/vhosts/aur-dev.archlinux.org/public/web/lib/pkgfuncs.inc.php on line 248

Package Details: authsae-git 20150123.8531ab1-1

Git Clone URL: https://aur-dev.archlinux.org/authsae-git.git (read-only)
Package Base: authsae-git
Description: Authsae provides secure password-based authentication for 802.11s mesh networking.
Upstream URL: https://github.com/cozybit/authsae
Licenses: BSD
Conflicts: authsae
Provides: authsae
Submitter: BrainDamage
Maintainer: BrainDamage
Last Packager: BrainDamage
Votes: 0
Popularity: 0.000000
First Submitted: 2015-01-23 22:18
Last Updated: 2015-06-13 16:56

Latest Comments

BrainDamage commented on 2016-04-20 19:31

javier.ruere: sorry if this is a bit late, but a glance at the code seems that it's an upstream bug, the functions do indeed return values which aren't used, which conflict with the compiler option to explicitly mark them as errors, howrever I am unsure what exactly sets that option, a quick grep in the code doesn't show that flag being set by the buildsystem explicitly, but it has -Wall -Werror which would enable all warnings and turn them into errors, therefore, it's best if you open a ticket upstream to fix the inconsistency

BrainDamage commented on 2016-04-20 19:11

My apologizes, I missed the first comment, otherwise I'd have fixed the deps sooner.

xamindar commented on 2016-04-20 19:00

this also requires cmake and libconfig. Please add it to the depends as this is not installed with base-devel. After installing these two, the package compiles successfully on my Raspberry Pi.

javier.ruere commented on 2015-10-12 01:18

It depends on libconfig and it doesn't work for me:

[ 94%] Building C object linux/CMakeFiles/meshd-nl80211.dir/meshd-nl80211.c.o
/tmp/yaourt-tmp-javier/aur-authsae-git/src/authsae/linux/meshd-nl80211.c: In function ‘main’:
/tmp/yaourt-tmp-javier/aur-authsae-git/src/authsae/linux/meshd-nl80211.c:1552:9: error: ignoring return value of ‘daemon’, declared with attribute warn_unused_result [-Werror=unused-result]
daemon(1, 0);
/tmp/yaourt-tmp-javier/aur-authsae-git/src/authsae/linux/meshd-nl80211.c:1555:9: error: ignoring return value of ‘freopen’, declared with attribute warn_unused_result [-Werror=unused-result]
freopen(outfile, "w", stdout);
cc1: all warnings being treated as errors
linux/CMakeFiles/meshd-nl80211.dir/build.make:62: recipe for target 'linux/CMakeFiles/meshd-nl80211.dir/meshd-nl80211.c.o' failed
make[2]: *** [linux/CMakeFiles/meshd-nl80211.dir/meshd-nl80211.c.o] Error 1
CMakeFiles/Makefile2:163: recipe for target 'linux/CMakeFiles/meshd-nl80211.dir/all' failed
make[1]: *** [linux/CMakeFiles/meshd-nl80211.dir/all] Error 2
Makefile:127: recipe for target 'all' failed
make: *** [all] Error 2
==> ERROR: A failure occurred in build().