Warning: file_exists(): open_basedir restriction in effect. File(/srv/http/vhosts/aur.archlinux.org/public/web/locale//en/LC_MESSAGES/aurweb.mo) is not within the allowed path(s): (/srv/http/vhosts/aur-dev.archlinux.org/:/etc/aurweb/) in /srv/http/vhosts/aur-dev.archlinux.org/public/web/lib/streams.php on line 90
AUR (en) - astroid

Notice: Undefined variable: name in /srv/http/vhosts/aur-dev.archlinux.org/public/web/lib/pkgfuncs.inc.php on line 248

Package Details: astroid 0.7-1

Git Clone URL: https://aur-dev.archlinux.org/astroid.git (read-only)
Package Base: astroid
Description: a graphical threads-with-tags style, lightweight and fast, email client for notmuch, inspired by sup and others
Upstream URL: https://github.com/astroidmail/astroid
Keywords: mail
Licenses: GPL
Submitter: gauteh
Maintainer: gauteh
Last Packager: gauteh
Votes: 8
Popularity: 1.075088
First Submitted: 2015-09-20 10:24
Last Updated: 2017-01-02 22:16

Latest Comments

« First ‹ Previous 1 2 3 4

thblt commented on 2016-02-12 13:21

Compilation succeeds, but test_theme fails:

linking Program ==> test/test_theme
Running tests in test/test_theme
Running 1 test case...
[info ] (14:16:23): welcome to astroid! - v0.5.r11.gef0a8a1
[debug] (14:16:23): utf8: 1, UTF-8
[info ] (14:16:23): cf: loading test config.
[TEST ] (14:16:23): cf: using home and config_dir directory: /tmp/yaourt-tmp-thblt/aur-astroid/src/astroid/test/test_home
[info ] (14:16:23): cf: test config, loading defaults.
[info ] (14:16:23): date: init.
[info ] (14:16:23): ac: initializing accounts..
[info ] (14:16:23): ac: setup account: charlie for Charlie Root (default: 1)
[info ] (14:16:23): global actions: set up.
[info ] (14:16:23): poll: setting up.
[debug] (14:16:23): poll: interval: 0
[info ] (14:16:23): poll: periodic polling disabled.
[debug] (14:16:23): theme: loading..
[ERROR] (14:16:23): re: could not find resource: ui/thread-view.html or /usr/share/astroid/ui/thread-view.html
scons: *** [test/test_theme.passed] Error 1
scons: building terminated because of errors.

gauteh commented on 2016-01-01 14:23

Should be fixed now.

hugoroy commented on 2015-12-31 17:14

I failed to build it:

```
compiling ==> src/astroid.cc
In file included from src/astroid.cc:25:0:
src/modes/edit_message.hh:160:7: error: reference to 'fstream' is ambiguous
fstream tmpfile;
^
In file included from /usr/include/boost/filesystem/string_file.hpp:14:0,
from /usr/include/boost/filesystem.hpp:19,
from src/astroid.cc:10:
/usr/include/boost/filesystem/fstream.hpp:171:31: note: candidates are: typedef class boost::filesystem::basic_fstream<char> boost::filesystem::fstream
typedef basic_fstream<char> fstream;
^
In file included from /usr/include/c++/5.3.0/ios:38:0,
from /usr/include/c++/5.3.0/ostream:38,
from /usr/include/c++/5.3.0/iostream:39,
from src/astroid.cc:1:
/usr/include/c++/5.3.0/iosfwd:168:33: note: typedef class std::basic_fstream<char> std::fstream
typedef basic_fstream<char> fstream;
^
scons: *** [src/astroid.o] Error 1
scons: building terminated because of errors.
```