Warning: file_exists(): open_basedir restriction in effect. File(/srv/http/vhosts/aur.archlinux.org/public/web/locale//en/LC_MESSAGES/aurweb.mo) is not within the allowed path(s): (/srv/http/vhosts/aur-dev.archlinux.org/:/etc/aurweb/) in /srv/http/vhosts/aur-dev.archlinux.org/public/web/lib/streams.php on line 90
AUR (en) - aqemu

Notice: Undefined variable: name in /srv/http/vhosts/aur-dev.archlinux.org/public/web/lib/pkgfuncs.inc.php on line 248

Package Details: aqemu 0.9.2-1

Git Clone URL: https://aur-dev.archlinux.org/aqemu.git (read-only)
Package Base: aqemu
Description: QEMU GUI written in Qt5
Upstream URL: https://github.com/tobimensch/aqemu
Licenses: GPL2
Submitter: None
Maintainer: fordprefect
Last Packager: fordprefect
Votes: 92
Popularity: 2.313025
First Submitted: 2008-10-17 11:02
Last Updated: 2016-05-31 13:06

Latest Comments

« First ‹ Previous 1 2 3 4 5 Next › Last »

edr commented on 2015-03-13 19:04

This package does not build anymore because it has no package() function.
The following change fixed it for me.

--- PKGBUILD.orig 2015-03-13 19:14:17.836184468 +0100
+++ PKGBUILD 2015-03-13 19:57:17.332821325 +0100
@@ -20,5 +20,9 @@
cmake -DCMAKE_INSTALL_PREFIX=/usr/ -DQT_QMAKE_EXECUTABLE=qmake4

make
- make DESTDIR=$pkgdir install
}
+
+package() {
+ cd $srcdir/$pkgname-$pkgver
+ make DESTDIR=$pkgdir install
+}

schmoemi commented on 2015-03-06 01:25

Maybe, as the version was released before ages. It is not outdated though as there haven't been newer releases since.

Kurisutian commented on 2014-05-22 12:06

Something seems to be wrong with the package. I cannot see any symbols or anything when starting aqemu.
I get this message before that:

Sender: int main( int argc, char *argv[] )
Message: Cannot Load AQEMU Icon Theme!
File "/usr/local/share/aqemu//oxygen_icons.rcc" Not Found!

Also created Windows VMs won't start claiming there would be not enough RAM to create a ramdisk. But I have 32GB in my computer and 8 GB reserved for the machine. So something seems to be off here. ;-)

SanskritFritz commented on 2013-03-14 20:07

Since there is no qemu-kvm anymore, aqemu does not work for me. There is no qemu binary and I cannot pursuede aqemu to find the correct executables.

mrbit commented on 2013-03-01 14:41

please update to qt4
add cmake -DQT_QMAKE_EXECUTABLE=qmake4
thanks

SanskritFritz commented on 2013-03-01 13:33

Please replace the qt dependency with qt4.

schmoemi commented on 2012-02-29 22:14

Patch added to fix that compile bug

malevolent commented on 2012-02-15 10:41

as seen on comments on the bug tracker:

Open file aqemu-0.8.2/Embedded_Display/vncview.cpp and comment lines 30-31
like this:

Before:
#define error(parent, message, caption) \
critical(parent, caption, message)

After:
/*#define error(parent, message, caption) \
critical(parent, caption, message)*/

Or use AUR package from Git ;)

schmoemi commented on 2012-01-29 03:15

This is a known bug, unfortunately:
http://sourceforge.net/tracker/?func=detail&aid=3429937&group_id=229794&atid=1078458

Anonymous comment on 2012-01-26 08:40

[ 56%] Building CXX object CMakeFiles/aqemu.dir/Embedded_Display/vncclientthread.o
[ 57%] Building CXX object CMakeFiles/aqemu.dir/Embedded_Display/vncview.o
In file included from /usr/include/QtGui/qevent.h:57:0,
from /usr/include/QtGui/QMouseEvent:1,
from /tmp/yaourt-tmp-root/aur-aqemu/src/aqemu-0.8.2/Embedded_Display/vncview.cpp:44:
/usr/include/QtCore/qfile.h:117:21: error: macro "error" requires 3 arguments, but only 1 given
/usr/include/QtCore/qfile.h:117:15: error: expected ‘;’ at end of member declaration
/usr/include/QtCore/qfile.h:117:23: error: declaration does not declare anything [-fpermissive]
make[2]: *** [CMakeFiles/aqemu.dir/Embedded_Display/vncview.o] Error 1
make[1]: *** [CMakeFiles/aqemu.dir/all] Error 2
make: *** [all] Error 2