Warning: file_exists(): open_basedir restriction in effect. File(/srv/http/vhosts/aur.archlinux.org/public/web/locale//en/LC_MESSAGES/aurweb.mo) is not within the allowed path(s): (/srv/http/vhosts/aur-dev.archlinux.org/:/etc/aurweb/) in /srv/http/vhosts/aur-dev.archlinux.org/public/web/lib/streams.php on line 90
AUR (en) - amule-adnza

Notice: Undefined variable: name in /srv/http/vhosts/aur-dev.archlinux.org/public/web/lib/pkgfuncs.inc.php on line 248

Package Details: amule-adnza 2012.1-11

Git Clone URL: https://aur-dev.archlinux.org/amule-adnza.git (read-only)
Package Base: amule-adnza
Description: aMule patched for Fastweb Network (Italy) by Adunanza forum
Upstream URL: http://amule-adunanza.sourceforge.net/
Licenses: GPL
Conflicts: amule, amule-adnza-svn, amule-adunanza
Provides: amule=2.3.1
Submitter: bardo
Maintainer: Guidobelix
Last Packager: Guidobelix
Votes: 19
Popularity: 0.000076
First Submitted: 2005-09-24 16:53
Last Updated: 2015-06-16 16:18

Latest Comments

« First ‹ Previous 1 2 3 4 Next › Last »

nTia89 commented on 2014-01-15 20:02

now should really works!
try it again

tago commented on 2014-01-15 14:25

Ciao, ho provato ma non funziona, mi dice che manca la dipendenza a wxgtk 2.8... :/

nTia89 commented on 2014-01-14 23:13

package is now fixed!

added in ./configure the further switch "--with-wxversion=2.8"
(although with "--with-wx-config=/usr/bin/wx-config-2.8" works as well...)

snoomerz commented on 2014-01-13 20:38

Now the package needs wxgtk2.8 that it's different from wxgtk.

nTia89 commented on 2012-12-01 11:28

updated the package.

i've modified the launcher icon, name and added a comment (.desktop)

nTia89 commented on 2012-11-29 22:04

updated!

lantuin commented on 2012-11-29 21:53

==> Validazione dei sorgenti con md5sums in corso...
aMule-AdunanzA-2012.1-2.3.1.tar.bz2 ... NON RIUSCITO
==> ERRORE: Uno o più file non hanno superato il controllo di validità!
==> ERRORE: Makepkg non è riuscito a compilare amule-adnza.

Correggi l'md5sum del pacchetto!

nTia89 commented on 2012-11-28 18:00

i've adopt the package, now it works!

zukka commented on 2012-09-09 07:57

adding this patch makes compilation work

--- aMule-AdunanzA-2010.1-2.2.6/src/ObservableQueue.h 2010-02-03 18:14:39.000000000 +0100
+++ aMule-AdunanzA-2010.1-2.2.6_patched/src/ObservableQueue.h 2012-09-09 09:37:58.019977161 +0200
@@ -331,14 +331,14 @@
template <typename ValueType>
void CObservableQueue<ValueType>::ObserverAdded( ObserverType* o )
{
- NotifyObservers( EventType( EventType::STARTING ), o );
+ this->NotifyObservers( EventType( EventType::STARTING ), o );
}


template <typename ValueType>
void CObservableQueue<ValueType>::ObserverRemoved( ObserverType* o )
{
- NotifyObservers( EventType( EventType::STOPPING ), o );
+ this->NotifyObservers( EventType( EventType::STOPPING ), o );
}


kiodo1981 commented on 2012-09-09 07:00

make[3]: *** [amule-DownloadQueue.o] Errore 1
make[2]: *** [all-recursive] Errore 1
make[1]: *** [all-recursive] Errore 1
make: *** [all] Errore 2
==> ERRORE: Si è verificato un errore in build().
L'operazione sta per essere interrotta...

Ho risolto usando il pacchetto CCR di chakra. Non la trovo la migliore soluzione.