Warning: file_exists(): open_basedir restriction in effect. File(/srv/http/vhosts/aur.archlinux.org/public/web/locale//en/LC_MESSAGES/aurweb.mo) is not within the allowed path(s): (/srv/http/vhosts/aur-dev.archlinux.org/:/etc/aurweb/) in /srv/http/vhosts/aur-dev.archlinux.org/public/web/lib/streams.php on line 90
AUR (en) - amule-adnza-svn

Notice: Undefined variable: name in /srv/http/vhosts/aur-dev.archlinux.org/public/web/lib/pkgfuncs.inc.php on line 248

Package Details: amule-adnza-svn 548-1

Git Clone URL: https://aur-dev.archlinux.org/amule-adnza-svn.git (read-only)
Package Base: amule-adnza-svn
Description: aMule patched for Fastweb Network (Italy) by Adunanza forum - SVN development branch
Upstream URL: http://amule-adunanza.sourceforge.net/
Licenses: GPL
Conflicts: amule, amule-adnza
Provides: amule
Submitter: ilpianista
Maintainer: Guidobelix
Last Packager: Guidobelix
Votes: 4
Popularity: 0.000000
First Submitted: 2008-12-28 23:42
Last Updated: 2016-02-05 22:29

Latest Comments

1 2 3 4 Next › Last »

ilventu commented on 2016-12-12 21:01

Now it works. Probably it was only a problem in dependencies versions.

ilventu commented on 2016-09-24 13:19

It fails to build:

PartFile.h: In member function ‘bool CPartFile::IsStopped() const’:
PartFile.h:214:40: warning: nonnull argument ‘this’ compared to NULL [-Wnonnull-compare]
bool IsStopped() const { return this ? m_stopped : true; }
mv -f .deps/amule-ClientCreditsList.Tpo .deps/amule-ClientCreditsList.Po
mv -f .deps/amule-ClientTCPSocket.Tpo .deps/amule-ClientTCPSocket.Po
make[3]: Leaving directory '/home/andrea/build/amule-adnza-svn/src/mrhydeit-build/src'
make[2]: *** [Makefile:5085: all-recursive] Error 1
make[2]: Leaving directory '/home/andrea/build/amule-adnza-svn/src/mrhydeit-build/src'
make[1]: *** [Makefile:652: all-recursive] Error 1
make[1]: Leaving directory '/home/andrea/build/amule-adnza-svn/src/mrhydeit-build'
make: *** [Makefile:546: all] Error 2
==> ERROR: A failure occurred in build().

And I can't figure out why... (linux-raspberrypi 4.4.21-1, gcc 6.2.1-1, make 4.2.1-1)

Guidobelix commented on 2015-06-16 18:26

I hae adopted the package and moved it to Aur4.
I have also added the systemd files (taken from amule package).
As the trunk has not been updated since the last stable version, this package now points to the developmnent branch.

nTia89 commented on 2015-06-02 09:08

I can't be no more the maintainer of this (and all of mine) package, so I disown it. In the hope this package will be adopted by someone who will take care as I do it, goodbye

nTia89 commented on 2015-06-02 08:57

I can't no more be the maintainer of this (and all of mine) package, so I disown it.

nTia89 commented on 2014-09-01 09:48

I uploaded a new package, anyway this doesn't compile, due to broken source I think...

nTia89 commented on 2012-11-28 18:04

i've adopt the package "amule-adnza", and updated it since, for the moment, there is no need of the SVN version.

SVN version will be not-updated, for the moment.

use it instead: https://aur.archlinux.org/packages/amule-adnza/

nTia89 commented on 2012-11-28 18:02

i've adopt the package "amule-adnza", and updated it since, for the moment, there is no need of SVN version, that it will be not-updated, for the moment .


nTia89 commented on 2012-10-07 10:15

latest (425) revision doesn't work too!

nTia89 commented on 2012-09-21 16:31

latest (422) revision doesn't work!